{"text_format":"1","workbook":"xlsx","n_sheets":4,"sheets":["Form","Balance","CMR","Data"],"not_rendered":{"charts":0,"images":1,"macros":1,"external_links":0,"defined_names":208,"comments":0,"pivot_tables":0},"unopened":[],"bounds":{"document_bytes":16777216,"sheet_cells":100000,"rows_first":2000,"rows_last":500,"rows_between":2000,"halvings":0,"cell_chars":16384,"cell_head_chars":4096},"cells_cut":0,"cells_raw":0,"read":"whole","date_system":"1900"}

{"sheet":"Form","index":0,"n_rows":31,"n_cols":16,"rows_kept":31,"cut":false,"hidden":false,"merged":[[2,6,2,7],[2,1,2,5],[1,1,1,5],[3,1,3,7],[28,12,28,13],[27,12,27,13],[2,13,2,14],[3,13,3,14],[26,12,26,13],[21,12,21,14],[25,12,25,13],[2,9,2,12],[16,9,17,11],[3,9,3,12],[15,12,16,15]]}
[]
[null,{"$f":"IF(AND(WSIZE>0,HSIZE>0),\"Only Available At\"&\"  \"&WSIZE&\" x \"&HSIZE&IF(HCONTROL=1,\" / \"&HSIZE2&\" / \"&HSIZE3&\" / \"&HSIZE4,\"\"),\"\")","v":""},null,null,null,null,null,"Select a Model",null,{"$f":"IF(ISERROR(OR(SHATERROR,SHATRADIUS,MINRADIUS,MAX_SHORT)),\"\",IF(SHATERROR=1,\"Adjust CMR to Increase Egress Height\",IF(SHATRADIUS<MINRADIUS,\"Radius Must be Greater Than \"&MINRADIUS,\"\")))","v":""}]
[null,{"$f":"IF(Model_Select=\"\",\"Select a Model\",\"(Model\"&\" \"&ModelNo&\")\")","v":"(Model Select Model)"},null,null,null,null,"Select Model",null,null,{"$f":"\"Min. W:\"&\" \"&MINW","v":"Min. W: 0"},null,null,null,{"$f":"\"Max W:\"&\" \"&MAXW","v":"Max W: 0"}]
[null,{"$f":"Description","v":0},null,null,null,null,null,null,null,{"$f":"\"Min. H:\"&\" \"&MINH","v":"Min. H: 0"},null,null,null,{"$f":"\"Max H:\"&\" \"&MAXH","v":"Max H: 0"},null,{"$f":"\"Max UI:\"&\" \"&MAXUI","v":"Max UI: 0"}]
[null,{"$f":"IF(AND(W>0,H>0),(IF(ISERROR(VLOOKUP(1,Data!$A:$D,3,FALSE)),\"\",VLOOKUP(1,Data!$A:$D,3,FALSE))),\"\")","v":""},null,null,null,null,null,{"$f":"IF(AND(W>0,H>0),(IF(ISERROR(VLOOKUP(1,Data!$A:$D,4,FALSE)),\"\",VLOOKUP(1,Data!$A:$D,4,FALSE))),\"\")","v":""},null,null,null,null,null,"Exact Size",{"$f":"IF(AND(DIM_3=1,_DIM3=0),\"Must Enter DIM3\",IF(AND(DIM_4=1,_DIM4=0),\"Must Enter DIM4\",\"\"))","v":""}]
[null,{"$f":"IF(AND(W>0,H>0),(IF(ISERROR(VLOOKUP(2,Data!$A:$D,3,FALSE)),\"\",VLOOKUP(2,Data!$A:$D,3,FALSE))),\"\")","v":""},null,null,null,null,null,{"$f":"IF(AND(W>0,H>0),(IF(ISERROR(VLOOKUP(2,Data!$A:$D,4,FALSE)),\"\",VLOOKUP(2,Data!$A:$D,4,FALSE))),\"\")","v":""},null,"Width:",null,null,null,{"$f":"IF(AND(RO=2,W>0),W-WCUTBACK,W)","v":0},null,{"$f":"IF(DIM_3=1,\"<< DIM3\",\"\")","v":""}]
[null,{"$f":"IF(AND(W>0,H>0),(IF(ISERROR(VLOOKUP(3,Data!$A:$D,3,FALSE)),\"\",VLOOKUP(3,Data!$A:$D,3,FALSE))),\"\")","v":""},null,null,null,null,null,{"$f":"IF(AND(W>0,H>0),(IF(ISERROR(VLOOKUP(3,Data!$A:$D,4,FALSE)),\"\",VLOOKUP(3,Data!$A:$D,4,FALSE))),\"\")","v":""},null,"Height:",null,null,null,{"$f":"IF(AND(RO=2,H>0),H-HCUTBACK,H)","v":0},null,{"$f":"IF(DIM_4=1,\"<< DIM4\",\"\")","v":""}]
[null,{"$f":"IF(AND(W>0,H>0),(IF(ISERROR(VLOOKUP(4,Data!$A:$D,3,FALSE)),\"\",VLOOKUP(4,Data!$A:$D,3,FALSE))),\"\")","v":""},null,null,null,null,null,{"$f":"IF(AND(W>0,H>0),(IF(ISERROR(VLOOKUP(4,Data!$A:$D,4,FALSE)),\"\",VLOOKUP(4,Data!$A:$D,4,FALSE))),\"\")","v":""},null,{"$f":"IF(OR(ModelNo=\"A140\",ModelNo=\"A144\",ModelNo=\"A146\",ModelNo=\"A740\",ModelNo=\"A744\",ModelNo=\"A746\",ModelNo=\"A840\",ModelNo=\"A844\",ModelNo=\"A846\"),\"Leg:\",\"\")","v":""},null,null,null,{"$f":"LEG_MESSAGE","v":""}]
{"$rows_left_out":24}
{"sheet":"Balance","index":1,"n_rows":235,"n_cols":83,"rows_kept":235,"cut":false,"hidden":true,"merged":[[44,58,44,61],[45,58,45,60],[46,58,46,60],[0,38,0,46],[1,1,1,3],[1,10,1,17],[1,38,1,41],[1,43,1,46],[1,23,1,24],[0,65,0,73],[1,65,1,68],[1,70,1,73],[21,58,21,60],[19,58,19,61],[20,58,20,60],[2,58,2,60]]}
[null,null,null,null,null,null,null,null,null,null,null,null,null,null,null,null,null,null,null,null,null,null,null,null,null,null,null,null,null,null,null,null,null,null,null,null,null,null,"West Coast Models BLOCK & TACKLE BALANCE CHART",null,null,null,null,null,null,null,null,null,null,null,null,null,null,null,null,null,null,null,null,null,null,null,null,null,null,"East Coast Models BLOCK & TACKLE BALANCE CHART"]
[null,"CFB",null,null,null,null,null,null,"Glass Strength",null,"Weight Calculation",null,null,null,null,null,null,null,null,null,null,null,null,"A201 Egress Calculation",null,null,null,null,null,null,null,null,null,null,null,null,null,null,"TOP SASH",null,null,null,null,"BOTTOM SASH",null,null,null,null,null,null,null,null,null,null,null,null,null,null,null,null,null,null,null,null,null,"TOP SASH",null,null,null,null,"BOTTOM SASH"]
[null,4,3,"BN",null,1,"S",{"$f":"1.157*2","v":2.3140000000000001},"Single Strength (2.5 mm)",null,"Model","CDIM","Sash Width/Height","Top Sash Height","Bottom Sash Weight","Top Sash Weight","Bal. Loc.","Head + Sill + 4.5","Sill","EW","EH","EO",null,"# of Coils",{"$f":"IF(BTM_WGT>0,VLOOKUP(BTM_WGT,CFB_W,3,FALSE),0)","v":{"$error":"#N/A"}},null,null,"A571","Length","Weight/ft","Weight",null,"A581","Length","Weight/ft","Weight",null,null,"Sash Weight","Tube Length","Balance","Weight",null,"Sash Weight","Tube Length","Balance","Weight",null,null,null,"Standard","Climatech","Climatech-2","Climatech Plus","Climatech-10",null,null,null,"Tube Length",null,null,null,null,null,null,"Sash Weight","Tube Length","Balance","Weight",null,"Sash Weight","Tube Length","Balance","Weight"]
[null,{"$f":"B3+1","v":5},3,"BN",null,2,"D",{"$f":"1.6*2","v":3.2},"Double Strength (3 mm)",null,{"$f":"ModelNo","v":"Select Model"},{"$f":"VLOOKUP(ModelNo,$K$5:$V$83,2,FALSE)","v":{"$error":"#N/A"}},{"$f":"VLOOKUP(ModelNo,$K$5:$V$83,3,FALSE)","v":{"$error":"#N/A"}},{"$f":"VLOOKUP(ModelNo,$K$5:$V$83,4,FALSE)","v":{"$error":"#N/A"}},{"$f":"VLOOKUP(ModelNo,$K$5:$V$83,5,FALSE)","v":{"$error":"#N/A"}},{"$f":"VLOOKUP(ModelNo,$K$5:$V$83,6,FALSE)","v":{"$error":"#N/A"}},{"$f":"VLOOKUP(ModelNo,$K$5:$V$83,7,FALSE)","v":{"$error":"#N/A"}},{"$f":"VLOOKUP(ModelNo,$K$5:$V$83,8,FALSE)","v":{"$error":"#N/A"}},{"$f":"VLOOKUP(ModelNo,$K$5:$V$83,9,FALSE)","v":{"$error":"#N/A"}},{"$f":"VLOOKUP(ModelNo,$K$5:$V$83,10,FALSE)","v":{"$error":"#N/A"}},{"$f":"VLOOKUP(ModelNo,$K$5:$V$83,11,FALSE)","v":{"$error":"#N/A"}},{"$f":"ROUND(((EH*EW)/144),3)","v":{"$error":"#N/A"}},null,"Displacement",{"$f":"IF($M$4>37.5,$M$4-36,0)","v":{"$error":"#N/A"}},null,null,"Top Top Rail",0,0,{"$f":"AC4*AD4","v":0},null,"Top Top Rail",0,0,{"$f":"AH4*AI4","v":0},null,null,{"$f":"TRUNC(TOP_WGT)","v":{"$error":"#N/A"}},{"$f":"AM9","v":{"$error":"#N/A"}},"Number","Range",null,{"$f":"TRUNC(BTM_WGT)","v":{"$error":"#N/A"}},{"$f":"AR9","v":{"$error":"#N/A"}},"Number","Range",null,null,0.75,null,"Climatech-4","Climatech-SC","Climatech-7","Climatech TG2",null,null,null,"Model","Top","Bott",null,null,null,null,{"$f":"TRUNC(TOP_WGT)","v":{"$error":"#N/A"}},{"$f":"TOPTUBELENGTH","v":{"$error":"#N/A"}},"Number","Range",null,{"$f":"TRUNC(BTM_WGT)","v":{"$error":"#N/A"}},{"$f":"BOTTUBELENGTH","v":{"$error":"#N/A"}},"Number","Range",null,null,null,"Model","GW","GH",null,"Max Short"]
[null,6,3,"BN",null,3,"T",{"$f":"2.408*2","v":4.8159999999999998},"Triple Strength (5 mm)",null,"A171",null,null,null,null,null,null,null,null,null,null,null,null,"Coil Loc. From CMR",{"$f":"IF(OR(ModelNo=\"A571\",ModelNo=\"A581\"),0,(($Y$3-1)*1.58)+$Y$4+$Q$4+1.5)","v":{"$error":"#N/A"}},null,null,"Top Bottom Rail",0,0,{"$f":"AC5*AD5","v":0},null,"Top Bottom Rail",0,0,{"$f":"AH5*AI5","v":0},null,null,"Balance Size",{"$f":"IF(AND(AO5>0,AP5>0),AO5,0)","v":{"$error":"#N/A"}},{"$f":"IF($AN$4<=7,7,0)","v":{"$error":"#N/A"}},{"$f":"IF(AND(AO5=7,$AM$4>=2,$AM$4<=2.99),AO5&\"-\"&\"1\",0)","v":{"$error":"#N/A"}},null,"Balance Size",{"$f":"IF(AND(AT5>0,AU5>0),AT5,0)","v":{"$error":"#N/A"}},{"$f":"IF($AS$4<=7,7,0)","v":{"$error":"#N/A"}},{"$f":"IF(AND(AT5=7,$AR$4>=2,$AR$4<=2.99),AT5&\"-\"&\"1\",0)","v":{"$error":"#N/A"}},null,{"$f":"IF(AY5>\"\",1,\"\")","v":""},"Outside Pane",{"$f":"IF(AND(EXT_2=1,Thickness_Select=1),\"Clear\",\"\")","v":""},{"$f":"IF(AND(EXT_2=1,Thickness_Select=1),\"SB60\",\"\")","v":""},{"$f":"IF(AND(EXT_2=1,Thickness_Select=1),\"SB60\",\"\")","v":""},{"$f":"IF(AND(EXT_2=1,Thickness_Select=1),\"SB60\",\"\")","v":""},null,null,"Standard",null,{"$f":"IF(ModelNo=\"7SH2\",\"7SH2\",IF(ModelNo=\"7SH3\",\"7SH3\",\"A571\"))","v":"A571"},null,{"$f":"VLOOKUP($M$4,$BG$48:$BJ$67,4)","v":{"$error":"#N/A"}},null,null,null,null,"Balance Size",{"$f":"IF(AND(BP5>0,BQ5>0),BP5,0)","v":{"$error":"#N/A"}},{"$f":"IF($BO$4<=6,6,0)","v":{"$error":"#N/A"}},{"$f":"IF(AND(BP5=6,$BN$4>=2,$BN$4<=5),BP5&\"A\",0)","v":{"$error":"#N/A"}},null,"Balance Size",{"$f":"IF(AND(BU5>0,BV5>0),BU5,0)","v":{"$error":"#N/A"}},{"$f":"IF($BT$4<=6,6,0)","v":{"$error":"#N/A"}},{"$f":"IF(AND(BU5=6,$BS$4>=2,$BS$4<=5),BU5&\"A\",0)","v":{"$error":"#N/A"}},null,null,null,"A270",{"$f":"Frame_Width-2.3125","v":-2.3125},{"$f":"Frame_Height-2.3125","v":-2.3125},{"$f":"MAX(CA5:CB5)","v":-2.3125},86.25]
[null,7,4,"RD",null,4,"STG",{"$f":"1.157*3","v":3.4710000000000001},"Triple IG Single Strrength",null,"A172",{"$f":"A172CDIM","v":0},{"$f":"A172CDIM+1.0625","v":1.0625},null,null,null,null,null,null,{"$f":"Frame_Width-L6-4","v":-4},{"$f":"Frame_Height-3","v":-3},null,null,null,null,null,null,"Top Stile",0,0,{"$f":"(AC6*AD6)/12","v":0},null,"Top Stile",0,0,{"$f":"(AH6*AI6)/12","v":0},null,null,{"$f":"VLOOKUP((MAX(AN5:AN235)),AN5:AP235,3,FALSE)","v":{"$error":"#N/A"}},{"$error":"#N/A"},{"$error":"#N/A"},{"$f":"IF(AND(AO6=7,$AM$4>=3,$AM$4<=3.99),AO6&\"-\"&\"2\",0)","v":{"$error":"#N/A"}},null,{"$f":"VLOOKUP((MAX(AS5:AS235)),AS5:AU235,3,FALSE)","v":{"$error":"#N/A"}},{"$error":"#N/A"},{"$error":"#N/A"},{"$f":"IF(AND(AT6=7,$AR$4>=3,$AR$4<=3.99),AT6&\"-\"&\"2\",0)","v":{"$error":"#N/A"}},null,{"$f":"IF(AY6>\"\",2,\"\")","v":""},"Middle Pane",{"$f":"IF(AND(EXT_2=1,Thickness_Select=1),\"N/A\",\"\")","v":""},{"$f":"IF(AND(EXT_2=1,Thickness_Select=1),\"N/A\",\"\")","v":""},{"$f":"IF(AND(EXT_2=1,Thickness_Select=1),\"N/A\",\"\")","v":""},{"$f":"IF(AND(EXT_2=1,Thickness_Select=1),\"N/A\",\"\")","v":""},null,null,"SolarTherm",null,{"$f":"IF(ModelNo=\"8SH2\",\"8SH2\",IF(ModelNo=\"8SH3\",\"8SH3\",\"A581\"))","v":"A581"},null,{"$f":"VLOOKUP($M$4,$BG$23:$BJ$42,4)","v":{"$error":"#N/A"}},null,null,null,null,{"$f":"VLOOKUP((MAX(BO5:BO229)),BO5:BQ229,3,FALSE)","v":{"$error":"#N/A"}},{"$error":"#N/A"},{"$error":"#N/A"},{"$f":"IF(AND(BP6=6,$BN$4>=6,$BN$4<=9),BP6&\"B\",0)","v":{"$error":"#N/A"}},null,{"$f":"VLOOKUP((MAX(BT5:BT229)),BT5:BV229,3,FALSE)","v":{"$error":"#N/A"}},{"$error":"#N/A"},{"$error":"#N/A"},{"$f":"IF(AND(BU6=6,$BS$4>=6,$BS$4<=9),BU6&\"B\",0)","v":{"$error":"#N/A"}},null,null,null,"A504",{"$f":"Frame_Width-4.625","v":-4.625},{"$f":"Frame_Height-4.625","v":-4.625},-4.625,86.5]
[null,8,4,"RD",null,5,"DTG",{"$f":"1.6*3","v":4.8000000000000007},"Triple IG Double Strength",null,"A173",{"$f":"A173CDIM","v":0.3125},{"$f":"A173CDIM+1.0625","v":1.375},null,null,null,null,null,null,{"$f":"Frame_Width-A173CDIM-M7-1.75","v":-3.4375},{"$f":"Frame_Height-3","v":-3},null,null,null,null,null,null,"Top Rail Reinf.",0,0,0,null,"Top Rail Reinf.",0,0,0,null,null,null,{"$error":"#N/A"},{"$error":"#N/A"},{"$f":"IF(AND(AO7=7,$AM$4>=4,$AM$4<=4.99),AO7&\"-\"&\"3\",0)","v":{"$error":"#N/A"}},null,null,{"$error":"#N/A"},{"$error":"#N/A"},{"$f":"IF(AND(AT7=7,$AR$4>=4,$AR$4<=4.99),AT7&\"-\"&\"3\",0)","v":{"$error":"#N/A"}},null,{"$f":"IF(AY7>\"\",3,\"\")","v":""},"Inside Pane",{"$f":"IF(AND(EXT_2=1,Thickness_Select=1),\"Clear\",\"\")","v":""},{"$f":"IF(AND(EXT_2=1,Thickness_Select=1),\"Clear\",\"\")","v":""},{"$f":"IF(AND(EXT_2=1,Thickness_Select=1),\"SB60\",\"\")","v":""},{"$f":"IF(AND(EXT_2=1,Thickness_Select=1),\"Clear\",\"\")","v":""},null,null,"SolarTherm-2",null,"82SP",null,{"$error":"#N/A"},null,null,null,null,null,{"$error":"#N/A"},{"$error":"#N/A"},{"$f":"IF(AND(BP7=6,$BN$4>=10,$BN$4<=12),BP7&\"C\",0)","v":{"$error":"#N/A"}},null,null,{"$error":"#N/A"},{"$error":"#N/A"},{"$f":"IF(AND(BU7=6,$BS$4>=10,$BS$4<=12),BU7&\"C\",0)","v":{"$error":"#N/A"}},null,null,null,"A570",{"$f":"Frame_Width-2.3125","v":-2.3125},{"$f":"Frame_Height-2.3125","v":-2.3125},-2.3125,86.25]
[null,9,5,"BU",null,6,"L",{"$f":"2.683*2","v":5.3659999999999997},"Laminated",null,"A175",{"$f":"A175CDIM","v":0.375},{"$f":"A175CDIM+1.0625","v":1.4375},null,null,null,null,null,null,{"$f":"Frame_Width-(M8*2)-(2.9*2)-1.01","v":-9.6850000000000005},{"$f":"Frame_Height-3","v":-3},null,null,null,null,null,null,"Top Stile Reinf",0,0,0,null,"Top Stile Reinf",0,0,0,null,null,"Top Tube length",{"$error":"#N/A"},{"$error":"#N/A"},{"$f":"IF(AND(AO8=7,$AM$4>=5,$AM$4<=5.99),AO8&\"-\"&\"4\",0)","v":{"$error":"#N/A"}},null,"Bott. Tube Length",{"$error":"#N/A"},{"$error":"#N/A"},{"$f":"IF(AND(AT8=7,$AR$4>=5,$AR$4<=5.99),AT8&\"-\"&\"4\",0)","v":{"$error":"#N/A"}},null,{"$f":"IF(AY8>\"\",4,\"\")","v":""},"Spacer",{"$f":"IF(AND(EXT_2=1,Thickness_Select=1),\"Intercept\",\"\")","v":""},{"$f":"IF(AND(EXT_2=1,Thickness_Select=1),\"Intercept\",\"\")","v":""},{"$f":"IF(AND(EXT_2=1,Thickness_Select=1),\"Intercept\",\"\")","v":""},{"$f":"IF(AND(EXT_2=1,Thickness_Select=1),\"SST\",\"\")","v":""},null,null,"SolarTherm Plus",null,"8SPS",null,{"$error":"#N/A"},null,null,null,null,null,{"$error":"#N/A"},{"$error":"#N/A"},{"$f":"IF(AND(BP8=6,$BN$4>=13,$BN$4<=15),BP8&\"D\",0)","v":{"$error":"#N/A"}},null,null,{"$error":"#N/A"},{"$error":"#N/A"},{"$f":"IF(AND(BU8=6,$BS$4>=13,$BS$4<=15),BU8&\"D\",0)","v":{"$error":"#N/A"}},null,null,null,"A770",{"$f":"Frame_Width-2.3125","v":-2.3125},{"$f":"Frame_Height-2.3125","v":-2.3125},-2.3125,86.25]
{"$rows_left_out":228}
{"sheet":"CMR","index":2,"n_rows":96,"n_cols":37,"rows_kept":96,"cut":false,"hidden":true,"merged":[[61,8,61,10],[30,16,30,18],[46,16,46,18],[31,16,31,18],[79,8,79,10],[49,11,49,12],[47,8,47,10],[13,1,13,3],[13,8,13,10],[14,8,14,10],[15,8,15,10],[26,8,26,9],[9,1,9,2],[10,1,10,2],[10,8,10,9],[12,8,12,10],[9,8,9,9],[12,1,12,3],[65,11,65,12],[62,8,62,10],[63,8,63,10],[1,4,1,5],[1,11,1,12],[42,8,42,9],[44,8,44,10],[45,8,45,10],[46,8,46,10],[41,8,41,9],[28,8,28,10],[29,8,29,10],[17,11,17,12],[33,11,33,12],[25,8,25,9],[30,8,30,10],[14,1,14,3],[15,1,15,3],[57,8,57,9],[58,8,58,9],[60,8,60,10],[31,8,31,10],[77,8,77,10],[78,8,78,10],[73,8,73,9],[74,8,74,9],[76,8,76,10],[93,8,93,10],[94,8,94,10],[95,8,95,10],[81,11,81,12],[89,8,89,9],[90,8,90,9],[92,8,92,10],[29,16,29,18],[1,19,1,20],[9,16,9,17],[10,16,10,17],[12,16,12,18],[13,16,13,18],[14,16,14,18],[15,16,15,18],[17,19,17,20],[25,16,25,17],[26,16,26,17],[28,16,28,18],[62,16,62,18],[63,16,63,18],[65,19,65,20],[81,19,81,20],[33,19,33,20],[41,16,41,17],[42,16,42,17],[44,16,44,18],[45,16,45,18],[47,16,47,18],[49,19,49,20],[57,16,57,17],[58,16,58,17],[60,16,60,18],[61,16,61,18],[94,16,94,18],[95,16,95,18],[73,16,73,17],[74,16,74,17],[76,16,76,18],[77,16,77,18],[78,16,78,18],[79,16,79,18],[92,16,92,18],[89,16,89,17],[93,16,93,18],[90,16,90,17]]}
[]
[null,null,"W",null,"A201",null,null,null,null,"W",null,"A140, A144, A146",null,null,"Frame Cut Leg",{"$f":"LEG+6","v":6},null,"W",null,"3A01"]
[null,null,{"$f":"IF(TYPE=1,C2,IF(TYPE= \"\",C2,\" \"))","v":"W"},1,{"$f":"Frame_Height/2","v":0},{"$f":"TRUNC(E3*16+0.5)/16","v":0},null,null,null,{"$f":"IF(TYPE=1,$J2,IF(TYPE= \"\",$J2,\" \"))","v":"W"},1,{"$f":"Frame_Height/2-CMRD","v":6},{"$f":"TRUNC(L3*16+0.5)/16","v":6},null,"CMRD",{"$f":"Frame_Height-P2","v":-6},null,{"$f":"IF(TYPE=1,R2,IF(TYPE= \"\",R2,\" \"))","v":"W"},1,{"$f":"Frame_Height/2","v":0},{"$f":"TRUNC(T3*16+0.5)/16","v":0},null,null,null,null,null,"Model","TSW","TSH","TGW","TGH","TGSF","BSW","BSH","BGW","BGH","BGSF"]
[null,null,{"$f":"IF(TYPE=5,C2,IF(TYPE=2,IF(Frame_Height>=54.5,IF(Frame_Height<72.5,C2,\"\"),\"\"),\"\"))","v":""},2,{"$f":"INT((Frame_Height/5)*48+0.5)/16","v":0},0,5,null,null,{"$f":"IF(TYPE=5,$J2,IF(TYPE=2,IF(Frame_Height>=54.5,IF(Frame_Height<72.5,$J2,\"\"),\"\"),\"\"))","v":""},2,{"$f":"INT((Frame_Height/5)*48+0.5)/16-CMRD","v":6},6,5,"Sash Cut back",null,null,{"$f":"IF(TYPE=5,R2,IF(TYPE=2,IF(Frame_Height>=54.5,IF(Frame_Height<72.5,R2,\"\"),\"\"),\"\"))","v":""},2,{"$f":"INT((Frame_Height/5)*48+0.5)/16","v":0},0,5,null,null,null,null,"A201",{"$f":"Data!D2","v":-3.25},{"$f":"Data!D3","v":-1.5625},{"$f":"Data!D6","v":-4.875},{"$f":"Data!D7","v":-3.1875},{"$f":"(AD4*AE4)/144","v":0.10791015625},{"$f":"Data!D4","v":-2.25},{"$f":"Data!D5","v":-0.5625},{"$f":"Data!D8","v":-3.875},{"$f":"Data!D9","v":-2.1875},{"$f":"(AI4*AJ4)/144","v":5.8865017361111112E-2}]
[null,null,{"$f":"IF(TYPE=6,C2,IF(AND(TYPE=2,OR(Frame_Height<54.5,Frame_Height>=72.5)),C2,\"\"))","v":""},null,{"$f":"INT((Frame_Height/3-0.22)*32+0.5)/16","v":-0.4375},-0.375,6,null,null,{"$f":"IF(TYPE=6,$J2,IF(AND(TYPE=2,OR(Frame_Height<54.5,Frame_Height>=72.5)),$J2,\"\"))","v":""},null,{"$f":"INT((Frame_Height/3-0.22)*32+0.5)/16-CMRD","v":5.5625},5.5625,6,null,null,null,{"$f":"IF(TYPE=6,R2,IF(AND(TYPE=2,OR(Frame_Height<54.5,Frame_Height>=72.5)),R2,\"\"))","v":""},null,{"$f":"INT((Frame_Height/3-0.22)*32+0.5)/16","v":-0.4375},-0.375,6,null,null,null,null,"A571",null,null,null,null,null,{"$f":"Data!D156","v":-2.125},{"$f":"Data!D157","v":-0.875},{"$f":"Data!D158","v":-4.3125},{"$f":"Data!D159","v":-3.0625},9.1715494791666671E-2]
[null,null,{"$f":"IF(TYPE=7,C2,IF(TYPE=3,IF(Frame_Height>=54.5,IF(Frame_Height<72.5,C2,\"\"),\"\"),\"\"))","v":""},3,{"$f":"INT((Frame_Height/5+0.55)*32+0.5)/16","v":1.125},1.125,7,null,null,{"$f":"IF(TYPE=7,$J2,IF(TYPE=3,IF(Frame_Height>=54.5,IF(Frame_Height<72.5,$J2,\"\"),\"\"),\"\"))","v":""},3,{"$f":"INT((Frame_Height/5+0.55)*32+0.5)/16-CMRD","v":7.125},7.125,7,null,null,null,{"$f":"IF(TYPE=7,R2,IF(TYPE=3,IF(Frame_Height>=54.5,IF(Frame_Height<72.5,R2,\"\"),\"\"),\"\"))","v":""},3,{"$f":"INT((Frame_Height/5+0.55)*32+0.5)/16","v":1.125},1.125,7,null,null,null,null,"A581",null,null,null,null,null,{"$f":"Data!D174","v":-2.8125},{"$f":"Data!D175","v":-1.5},{"$f":"Data!D176","v":-5.375},{"$f":"Data!D177","v":-4.0625},0.1516384548611111]
[null,null,{"$f":"IF(TYPE=8,C2,IF(AND(TYPE=3,OR(Frame_Height<54.5,Frame_Height>=72.5)),C2,\"\"))","v":""},null,{"$f":"INT((Frame_Height/3+1.4)*16+0.5)/16","v":1.375},1.375,8,null,null,{"$f":"IF(TYPE=8,$J2,IF(AND(TYPE=3,OR(Frame_Height<54.5,Frame_Height>=72.5)),$J2,\"\"))","v":""},null,{"$f":"INT((Frame_Height/3+1.4)*16+0.5)/16-CMRD","v":7.375},7.375,8,null,null,null,{"$f":"IF(TYPE=8,R2,IF(AND(TYPE=3,OR(Frame_Height<54.5,Frame_Height>=72.5)),R2,\"\"))","v":""},null,{"$f":"INT((Frame_Height/3+1.4)*16+0.5)/16","v":1.375},1.375,8,null,null,null,null,"A991",null,null,null,null,null,{"$f":"Data!D274","v":-2.8125},{"$f":"Data!D275","v":-1.5},{"$f":"Data!D276","v":-5.375},{"$f":"Data!D277","v":-4.0625},0.1516384548611111]
[null,null,{"$f":"IF(TYPE=4,C2,\"\")","v":""},4,{"$f":"Frame_Height-CMR","v":0},0,null,null,null,{"$f":"IF(TYPE=4,$J2,\"\")","v":""},4,{"$f":"CMR-CMRD","v":6},6,null,null,null,null,{"$f":"IF(TYPE=4,R2,\"\")","v":""},4,{"$f":"Frame_Height-CMR","v":0},0,null,null,null,null,null,"A501",{"$f":"Data!D363","v":-4.875},{"$f":"Data!D364","v":-1.65625},{"$f":"Data!D367","v":-6.6875},{"$f":"Data!D368","v":-3.46875},{"$f":"(AD8*AE8)/144","v":0.16109212239583334},{"$f":"Data!D365","v":-3.875},{"$f":"Data!D366","v":-0.65625},{"$f":"Data!D369","v":-6.6875},{"$f":"Data!D370","v":-3.46875},0.16109212239583334]
{"$rows_left_out":89}
{"sheet":"Data","index":3,"n_rows":1159,"n_cols":33,"rows_kept":1159,"cut":false,"hidden":true,"merged":[]}
[null,"Model","Description","Value"]
[{"$f":"IF(ModelNo=B2,1,\"\")","v":""},"A201","Top Sash Width",{"$f":"Frame_Width-3.25","v":-3.25},null,{"$f":"Model_Select","v":"Select Model"},"Models","Description","W cut-back","H-cut-back","Width","Height","Min W","Min H","Max W","Max H","Max UI","TYPE1","TYPE2","TYPE3","TYPE4","Dim3","Dim4","Screen1","Screen2","Screen3","Ext./Reinf.","Ext./Reinf.","Ext./Reinf.","Ext./Reinf.","Ext./Reinf.","Offset","Opening"]
[{"$f":"IF(ModelNo=B3,2,\"\")","v":""},"A201","Top Sash Height",{"$f":"CMR!$E$10-1.5625","v":-1.5625},null,1,"Select Model",0,0,0,0,0,0,0,0,0,0,0,0,0,0,null,null,0,0,0,0,0,0,0,0,0,0]
[{"$f":"IF(ModelNo=B4,3,\"\")","v":""},"A201","Bottom Sash Width",{"$f":"Frame_Width-2.25","v":-2.25},null,2,"3A01","Montrose Double Hung",null,null,null,null,12,20,{"$f":"IF(EXTSELECT=2,48,IF(EXTSELECT=3,52,\"\"))","v":""},{"$f":"IF(EXTSELECT=2,84,IF(EXTSELECT=3,96,\"\"))","v":""},{"$f":"IF(EXTSELECT=2,126,IF(EXTSELECT=3,148,\"\"))","v":""},"Standard","Oriel (2/3 - 1/3)","Cottage (1/3 - 2/3)","Custom",null,null,"Half","Full","Locking","Select Reinforcement","Composite","Steel",null,null,null,{"$f":"IF(RO=2,\"<< Exact Size Only\",\"\")","v":"<< Exact Size Only"}]
[{"$f":"IF(ModelNo=B5,4,\"\")","v":""},"A201","Bottom Sash Height",{"$f":"CMR!$E$11-0.5625","v":-0.5625},null,3,"3A02","Montrose Two Lite Slider",null,null,null,null,18.5,11.25,{"$f":"IF(EXTSELECT=2,72,IF(EXTSELECT=3,96,\"\"))","v":""},{"$f":"IF(EXTSELECT=2,56,IF(EXTSELECT=3,72,\"\"))","v":""},{"$f":"IF(EXTSELECT=2,128,IF(EXTSELECT=3,156,\"\"))","v":""},"Standard",null,null,null,null,null,"Half","Full",null,"Select Reinforcement","Composite","Steel",null,null,null,"<< Exact Size Only"]
[{"$f":"IF(ModelNo=B6,5,\"\")","v":""},"A201","Top Glass Width",{"$f":"CMR!$E$13","v":-4.875},null,4,"3A03","Montrose Three Lite Slider (1/4-1/2-1/4)",null,null,null,null,47.5,11.25,{"$f":"IF(EXTSELECT=2,108,IF(EXTSELECT=3,130,\"\"))","v":""},{"$f":"IF(EXTSELECT=2,56,IF(EXTSELECT=3,72,\"\"))","v":""},{"$f":"IF(EXTSELECT=2,164,IF(EXTSELECT=3,192,\"\"))","v":""},"Standard (1/4-1/2-1/4)",null,null,null,null,null,"Half","Full",null,"Select Reinforcement","Composite","Steel",null,null,null,"<< Exact Size Only"]
[{"$f":"IF(ModelNo=B7,6,\"\")","v":""},"A201","Top Glass Height",{"$f":"CMR!$E$15","v":-3.1875},null,5,"3A04","Montrose Picture Window",null,null,null,null,9.5,9.5,120,120,180,"Standard",null,null,null,null,null,null,null,null,null,null,null,null,null,null,"<< Exact Size Only"]
[{"$f":"IF(ModelNo=B8,7,\"\")","v":""},"A201","Bottom Glass Width",{"$f":"CMR!$E$14","v":-3.875},null,6,"3A09","Montrose Three Lite Slider Equal Lite",null,null,null,null,37.25,11.25,{"$f":"IF(EXTSELECT=2,108,IF(EXTSELECT=3,130,\"\"))","v":""},{"$f":"IF(EXTSELECT=2,56,IF(EXTSELECT=3,72,\"\"))","v":""},{"$f":"IF(EXTSELECT=2,164,IF(EXTSELECT=3,192,\"\"))","v":""},"Standard (1/3-1/3-1/3)",null,null,null,null,null,"Half","Full",null,"Select Reinforcement","Composite","Steel",null,null,null,"<< Exact Size Only"]
{"$rows_left_out":1151}