{"text_format":"1","workbook":"xlsx","n_sheets":4,"sheets":["Form","Balance","CMR","Data"],"not_rendered":{"charts":0,"images":1,"macros":1,"external_links":0,"defined_names":208,"comments":0,"pivot_tables":0},"unopened":[],"bounds":{"document_bytes":16777216,"sheet_cells":100000,"rows_first":2000,"rows_last":500,"rows_between":2000,"halvings":0,"cell_chars":16384,"cell_head_chars":4096},"cells_cut":0,"cells_raw":0,"read":"whole","date_system":"1900"}

{"sheet":"Form","index":0,"n_rows":31,"n_cols":16,"rows_kept":31,"cut":false,"hidden":false,"merged":[[2,6,2,7],[2,1,2,5],[1,1,1,5],[3,1,3,7],[28,12,28,13],[27,12,27,13],[2,13,2,14],[3,13,3,14],[26,12,26,13],[21,12,21,14],[25,12,25,13],[2,9,2,12],[16,9,17,11],[3,9,3,12],[15,12,16,15]]}
[]
[null,{"$f":"IF(AND(WSIZE>0,HSIZE>0),\"Only Available At\"&\"  \"&WSIZE&\" x \"&HSIZE&IF(HCONTROL=1,\" / \"&HSIZE2&\" / \"&HSIZE3&\" / \"&HSIZE4,\"\"),\"\")","v":""},null,null,null,null,null,"Select a Model",null,{"$f":"IF(ISERROR(OR(SHATERROR,SHATRADIUS,MINRADIUS,MAX_SHORT)),\"\",IF(SHATERROR=1,\"Adjust CMR to Increase Egress Height\",IF(SHATRADIUS<MINRADIUS,\"Radius Must be Greater Than \"&MINRADIUS,\"\")))","v":""}]
[null,{"$f":"IF(Model_Select=\"\",\"Select a Model\",\"(Model\"&\" \"&ModelNo&\")\")","v":"(Model Select Model)"},null,null,null,null,"Select Model",null,null,{"$f":"\"Min. W:\"&\" \"&MINW","v":"Min. W: 0"},null,null,null,{"$f":"\"Max W:\"&\" \"&MAXW","v":"Max W: 0"}]
[null,{"$f":"Description","v":0},null,null,null,null,null,null,null,{"$f":"\"Min. H:\"&\" \"&MINH","v":"Min. H: 0"},null,null,null,{"$f":"\"Max H:\"&\" \"&MAXH","v":"Max H: 0"},null,{"$f":"\"Max UI:\"&\" \"&MAXUI","v":"Max UI: 0"}]
[null,{"$f":"IF(AND(W>0,H>0),(IF(ISERROR(VLOOKUP(1,Data!$A:$D,3,FALSE)),\"\",VLOOKUP(1,Data!$A:$D,3,FALSE))),\"\")","v":""},null,null,null,null,null,{"$f":"IF(AND(W>0,H>0),(IF(ISERROR(VLOOKUP(1,Data!$A:$D,4,FALSE)),\"\",VLOOKUP(1,Data!$A:$D,4,FALSE))),\"\")","v":""},null,null,null,null,null,"Exact Size",{"$f":"IF(AND(DIM_3=1,_DIM3=0),\"Must Enter DIM3\",IF(AND(DIM_4=1,_DIM4=0),\"Must Enter DIM4\",\"\"))","v":""}]
[null,{"$f":"IF(AND(W>0,H>0),(IF(ISERROR(VLOOKUP(2,Data!$A:$D,3,FALSE)),\"\",VLOOKUP(2,Data!$A:$D,3,FALSE))),\"\")","v":""},null,null,null,null,null,{"$f":"IF(AND(W>0,H>0),(IF(ISERROR(VLOOKUP(2,Data!$A:$D,4,FALSE)),\"\",VLOOKUP(2,Data!$A:$D,4,FALSE))),\"\")","v":""},null,"Width:",null,null,null,{"$f":"IF(AND(RO=2,W>0),W-WCUTBACK,W)","v":0},null,{"$f":"IF(DIM_3=1,\"<< DIM3\",\"\")","v":""}]
[null,{"$f":"IF(AND(W>0,H>0),(IF(ISERROR(VLOOKUP(3,Data!$A:$D,3,FALSE)),\"\",VLOOKUP(3,Data!$A:$D,3,FALSE))),\"\")","v":""},null,null,null,null,null,{"$f":"IF(AND(W>0,H>0),(IF(ISERROR(VLOOKUP(3,Data!$A:$D,4,FALSE)),\"\",VLOOKUP(3,Data!$A:$D,4,FALSE))),\"\")","v":""},null,"Height:",null,null,null,{"$f":"IF(AND(RO=2,H>0),H-HCUTBACK,H)","v":0},null,{"$f":"IF(DIM_4=1,\"<< DIM4\",\"\")","v":""}]
[null,{"$f":"IF(AND(W>0,H>0),(IF(ISERROR(VLOOKUP(4,Data!$A:$D,3,FALSE)),\"\",VLOOKUP(4,Data!$A:$D,3,FALSE))),\"\")","v":""},null,null,null,null,null,{"$f":"IF(AND(W>0,H>0),(IF(ISERROR(VLOOKUP(4,Data!$A:$D,4,FALSE)),\"\",VLOOKUP(4,Data!$A:$D,4,FALSE))),\"\")","v":""},null,{"$f":"IF(OR(ModelNo=\"A140\",ModelNo=\"A144\",ModelNo=\"A146\",ModelNo=\"A740\",ModelNo=\"A744\",ModelNo=\"A746\",ModelNo=\"A840\",ModelNo=\"A844\",ModelNo=\"A846\"),\"Leg:\",\"\")","v":""},null,null,null,{"$f":"LEG_MESSAGE","v":""}]
[null,{"$f":"IF(AND(W>0,H>0),(IF(ISERROR(VLOOKUP(5,Data!$A:$D,3,FALSE)),\"\",VLOOKUP(5,Data!$A:$D,3,FALSE))),\"\")","v":""},null,null,null,null,null,{"$f":"IF(AND(W>0,H>0),(IF(ISERROR(VLOOKUP(5,Data!$A:$D,4,FALSE)),\"\",VLOOKUP(5,Data!$A:$D,4,FALSE))),\"\")","v":""},null,{"$f":"IF(BTYPE=\"Custom\",\"CMR:\",\"\")","v":""},null,null,null,{"$f":"CMR_MESSAGE","v":""}]
[null,{"$f":"IF(AND(W>0,H>0),(IF(ISERROR(VLOOKUP(6,Data!$A:$D,3,FALSE)),\"\",VLOOKUP(6,Data!$A:$D,3,FALSE))),\"\")","v":""},null,null,null,null,null,{"$f":"IF(AND(W>0,H>0),(IF(ISERROR(VLOOKUP(6,Data!$A:$D,4,FALSE)),\"\",VLOOKUP(6,Data!$A:$D,4,FALSE))),\"\")","v":""},null,{"$f":"IF(SELECTEXT=\"Select Extrusion\",\"Ext.\",IF(SELECTEXT=\"Select Reinforcement\",\"Reinforce:\",IF(SELECTEXT=\"Operator Position\",\"Operation:\",\"\")))","v":""},null,null,null,{"$f":"EXT_MESSAGE","v":""}]
[null,{"$f":"IF(AND(W>0,H>0),(IF(ISERROR(VLOOKUP(7,Data!$A:$D,3,FALSE)),\"\",VLOOKUP(7,Data!$A:$D,3,FALSE))),\"\")","v":""},null,null,null,null,null,{"$f":"IF(AND(W>0,H>0),(IF(ISERROR(VLOOKUP(7,Data!$A:$D,4,FALSE)),\"\",VLOOKUP(7,Data!$A:$D,4,FALSE))),\"\")","v":""},null,"Opening:",null,null,null,{"$f":"RO_OPTION","v":0}]
[null,{"$f":"IF(AND(W>0,H>0),(IF(ISERROR(VLOOKUP(8,Data!$A:$D,3,FALSE)),\"\",VLOOKUP(8,Data!$A:$D,3,FALSE))),\"\")","v":""},null,null,null,null,null,{"$f":"IF(AND(W>0,H>0),(IF(ISERROR(VLOOKUP(8,Data!$A:$D,4,FALSE)),\"\",VLOOKUP(8,Data!$A:$D,4,FALSE))),\"\")","v":""},null,"Type:"]
[null,{"$f":"IF(AND(W>0,H>0),(IF(ISERROR(VLOOKUP(9,Data!$A:$D,3,FALSE)),\"\",VLOOKUP(9,Data!$A:$D,3,FALSE))),\"\")","v":""},null,null,null,null,null,{"$f":"IF(AND(W>0,H>0),(IF(ISERROR(VLOOKUP(9,Data!$A:$D,4,FALSE)),\"\",VLOOKUP(9,Data!$A:$D,4,FALSE))),\"\")","v":""},null,"Screen:"]
[null,{"$f":"IF(AND(W>0,H>0),(IF(ISERROR(VLOOKUP(10,Data!$A:$D,3,FALSE)),\"\",VLOOKUP(10,Data!$A:$D,3,FALSE))),\"\")","v":""},null,null,null,null,null,{"$f":"IF(AND(W>0,H>0),(IF(ISERROR(VLOOKUP(10,Data!$A:$D,4,FALSE)),\"\",VLOOKUP(10,Data!$A:$D,4,FALSE))),\"\")","v":""},null,"Glass:"]
[]
[null,{"$f":"IF(AND(W>0,H>0),(IF(ISERROR(VLOOKUP(11,Data!$A:$D,3,FALSE)),\"\",VLOOKUP(11,Data!$A:$D,3,FALSE))),\"\")","v":""},null,null,null,null,null,{"$f":"IF(AND(W>0,H>0),(IF(ISERROR(VLOOKUP(11,Data!$A:$D,4,FALSE)),\"\",VLOOKUP(11,Data!$A:$D,4,FALSE))),\"\")","v":""},null,null,null,null,{"$f":"IF(O19=\"<< AC Sash Width\",\"A Designated AC Sash is Used to Replace BOTH Top and Bottom Sashes When AC is in the Window\",\"\")","v":""}]
[null,{"$f":"IF(AND(W>0,H>0),(IF(ISERROR(VLOOKUP(12,Data!$A:$D,3,FALSE)),\"\",VLOOKUP(12,Data!$A:$D,3,FALSE))),\"\")","v":""},null,null,null,null,null,{"$f":"IF(AND(W>0,H>0),(IF(ISERROR(VLOOKUP(12,Data!$A:$D,4,FALSE)),\"\",VLOOKUP(12,Data!$A:$D,4,FALSE))),\"\")","v":""},null,{"$f":"IF(AND(ACLINK=TRUE,OR(Model_Select=\"8PS3\",Model_Select=\"8SP3\",Model_Select=\"8SOP\")),\"AC sash not Available for this model\",\"\")","v":""}]
[null,{"$f":"IF(AND(W>0,H>0),(IF(ISERROR(VLOOKUP(13,Data!$A:$D,3,FALSE)),\"\",VLOOKUP(13,Data!$A:$D,3,FALSE))),\"\")","v":""},null,null,null,null,null,{"$f":"IF(AND(W>0,H>0),(IF(ISERROR(VLOOKUP(13,Data!$A:$D,4,FALSE)),\"\",VLOOKUP(13,Data!$A:$D,4,FALSE))),\"\")","v":""}]
[null,{"$f":"IF(AND(W>0,H>0),(IF(ISERROR(VLOOKUP(14,Data!$A:$D,3,FALSE)),\"\",VLOOKUP(14,Data!$A:$D,3,FALSE))),\"\")","v":""},null,null,null,null,null,{"$f":"IF(AND(W>0,H>0),(IF(ISERROR(VLOOKUP(14,Data!$A:$D,4,FALSE)),\"\",VLOOKUP(14,Data!$A:$D,4,FALSE))),\"\")","v":""},null,{"$f":"IF(ACLINK=FALSE,\"\",\"AC Width:\")","v":""},null,null,null,{"$f":"IF(AND(W>0,H>0,ACWIDTH>0,ACHEIGHT>0,ACCMR>0,ACLINK=TRUE),ACCMR,IF(AND(W>0,H>0,ACWIDTH>0,ACSASHW>0,ACLINK=TRUE),ACSASHW,\"\"))","v":""},{"$f":"IF(AND(W>0,H>0,ACWIDTH>0,ACHEIGHT>0,ACCMR>0,ACLINK=TRUE),\"<< CMR\",IF(AND(W>0,H>0,ACWIDTH>0,ACSASHW>0,ACLINK=TRUE),\"<< AC Sash Width\",\"\"))","v":""}]
[null,{"$f":"IF(AND(W>0,H>0),(IF(ISERROR(VLOOKUP(15,Data!$A:$D,3,FALSE)),\"\",VLOOKUP(15,Data!$A:$D,3,FALSE))),\"\")","v":""},null,null,null,null,null,{"$f":"IF(AND(W>0,H>0),(IF(ISERROR(VLOOKUP(15,Data!$A:$D,4,FALSE)),\"\",VLOOKUP(15,Data!$A:$D,4,FALSE))),\"\")","v":""},null,{"$f":"IF(ACLINK=FALSE,\"\",\"AC Height:\")","v":""},null,null,null,{"$f":"IF(AND(W>0,H>0,ACHEIGHT>0,ACSASHH>0,ACLINK=TRUE),ACSASHH,\"\")","v":""},{"$f":"IF(AND(ACCMR>0,ACLINK=TRUE),\"\",IF(AND(W>0,H>0,ACHEIGHT>0,ACSASHH>0,ACLINK=TRUE),\"<< AC Sash Height\",\"\"))","v":""}]
[null,{"$f":"IF(AND(W>0,H>0),(IF(ISERROR(VLOOKUP(16,Data!$A:$D,3,FALSE)),\"\",VLOOKUP(16,Data!$A:$D,3,FALSE))),\"\")","v":""},null,null,null,null,null,{"$f":"IF(AND(W>0,H>0),(IF(ISERROR(VLOOKUP(16,Data!$A:$D,4,FALSE)),\"\",VLOOKUP(16,Data!$A:$D,4,FALSE))),\"\")","v":""},null,{"$f":"IF(ISERROR(TSW),\"\",IF(LIMIT1>\"\",LIMIT1&IF(LIMIT2>\"\",\" & \"&LIMIT2),\"\"))","v":""}]
[null,{"$f":"IF(AND(W>0,H>0),(IF(ISERROR(VLOOKUP(17,Data!$A:$D,3,FALSE)),\"\",VLOOKUP(17,Data!$A:$D,3,FALSE))),\"\")","v":""},null,null,null,null,null,{"$f":"IF(AND(W>0,H>0),(IF(ISERROR(VLOOKUP(17,Data!$A:$D,4,FALSE)),\"\",VLOOKUP(17,Data!$A:$D,4,FALSE))),\"\")","v":""}]
[null,{"$f":"IF(AND(W>0,H>0),(IF(ISERROR(VLOOKUP(18,Data!$A:$D,3,FALSE)),\"\",VLOOKUP(18,Data!$A:$D,3,FALSE))),\"\")","v":""},null,null,null,null,null,{"$f":"IF(AND(W>0,H>0),(IF(ISERROR(VLOOKUP(18,Data!$A:$D,4,FALSE)),\"\",VLOOKUP(18,Data!$A:$D,4,FALSE))),\"\")","v":""}]
[null,{"$f":"IF(AND(W>0,H>0),(IF(ISERROR(VLOOKUP(19,Data!$A:$D,3,FALSE)),\"\",VLOOKUP(19,Data!$A:$D,3,FALSE))),\"\")","v":""},null,null,null,null,null,{"$f":"IF(AND(W>0,H>0),(IF(ISERROR(VLOOKUP(19,Data!$A:$D,4,FALSE)),\"\",VLOOKUP(19,Data!$A:$D,4,FALSE))),\"\")","v":""}]
[null,{"$f":"IF(AND(W>0,H>0),(IF(ISERROR(VLOOKUP(20,Data!$A:$D,3,FALSE)),\"\",VLOOKUP(20,Data!$A:$D,3,FALSE))),\"\")","v":""},null,null,null,null,null,{"$f":"IF(AND(W>0,H>0),(IF(ISERROR(VLOOKUP(20,Data!$A:$D,4,FALSE)),\"\",VLOOKUP(20,Data!$A:$D,4,FALSE))),\"\")","v":""}]
[null,{"$f":"IF(AND(W>0,H>0),(IF(ISERROR(VLOOKUP(21,Data!$A:$D,3,FALSE)),\"\",VLOOKUP(21,Data!$A:$D,3,FALSE))),\"\")","v":""},null,null,null,null,null,{"$f":"IF(AND(W>0,H>0),(IF(ISERROR(VLOOKUP(21,Data!$A:$D,4,FALSE)),\"\",VLOOKUP(21,Data!$A:$D,4,FALSE))),\"\")","v":""}]
[null,{"$f":"IF(AND(W>0,H>0),(IF(ISERROR(VLOOKUP(22,Data!$A:$D,3,FALSE)),\"\",VLOOKUP(22,Data!$A:$D,3,FALSE))),\"\")","v":""},null,null,null,null,null,{"$f":"IF(AND(W>0,H>0),(IF(ISERROR(VLOOKUP(22,Data!$A:$D,4,FALSE)),\"\",VLOOKUP(22,Data!$A:$D,4,FALSE))),\"\")","v":""}]
[null,{"$f":"IF(AND(W>0,H>0),(IF(ISERROR(VLOOKUP(23,Data!$A:$D,3,FALSE)),\"\",VLOOKUP(23,Data!$A:$D,3,FALSE))),\"\")","v":""},null,null,null,null,null,{"$f":"IF(AND(W>0,H>0),(IF(ISERROR(VLOOKUP(23,Data!$A:$D,4,FALSE)),\"\",VLOOKUP(23,Data!$A:$D,4,FALSE))),\"\")","v":""}]
[null,{"$f":"IF(AND(W>0,H>0),(IF(ISERROR(VLOOKUP(24,Data!$A:$D,3,FALSE)),\"\",VLOOKUP(24,Data!$A:$D,3,FALSE))),\"\")","v":""},null,null,null,null,null,{"$f":"IF(AND(W>0,H>0),(IF(ISERROR(VLOOKUP(24,Data!$A:$D,4,FALSE)),\"\",VLOOKUP(24,Data!$A:$D,4,FALSE))),\"\")","v":""}]
[]
[null,{"$f":"IF(AND(W>0,H>0,ACWIDTH>ACSASHW,ACLINK=TRUE),\"AC Width is Larger Than The Sash Width\",\"\")","v":""}]

{"sheet":"Balance","index":1,"n_rows":235,"n_cols":83,"rows_kept":235,"cut":false,"hidden":true,"merged":[[44,58,44,61],[45,58,45,60],[46,58,46,60],[0,38,0,46],[1,1,1,3],[1,10,1,17],[1,38,1,41],[1,43,1,46],[1,23,1,24],[0,65,0,73],[1,65,1,68],[1,70,1,73],[21,58,21,60],[19,58,19,61],[20,58,20,60],[2,58,2,60]]}
[null,null,null,null,null,null,null,null,null,null,null,null,null,null,null,null,null,null,null,null,null,null,null,null,null,null,null,null,null,null,null,null,null,null,null,null,null,null,"West Coast Models BLOCK & TACKLE BALANCE CHART",null,null,null,null,null,null,null,null,null,null,null,null,null,null,null,null,null,null,null,null,null,null,null,null,null,null,"East Coast Models BLOCK & TACKLE BALANCE CHART"]
[null,"CFB",null,null,null,null,null,null,"Glass Strength",null,"Weight Calculation",null,null,null,null,null,null,null,null,null,null,null,null,"A201 Egress Calculation",null,null,null,null,null,null,null,null,null,null,null,null,null,null,"TOP SASH",null,null,null,null,"BOTTOM SASH",null,null,null,null,null,null,null,null,null,null,null,null,null,null,null,null,null,null,null,null,null,"TOP SASH",null,null,null,null,"BOTTOM SASH"]
[null,4,3,"BN",null,1,"S",{"$f":"1.157*2","v":2.3140000000000001},"Single Strength (2.5 mm)",null,"Model","CDIM","Sash Width/Height","Top Sash Height","Bottom Sash Weight","Top Sash Weight","Bal. Loc.","Head + Sill + 4.5","Sill","EW","EH","EO",null,"# of Coils",{"$f":"IF(BTM_WGT>0,VLOOKUP(BTM_WGT,CFB_W,3,FALSE),0)","v":{"$error":"#N/A"}},null,null,"A571","Length","Weight/ft","Weight",null,"A581","Length","Weight/ft","Weight",null,null,"Sash Weight","Tube Length","Balance","Weight",null,"Sash Weight","Tube Length","Balance","Weight",null,null,null,"Standard","Climatech","Climatech-2","Climatech Plus","Climatech-10",null,null,null,"Tube Length",null,null,null,null,null,null,"Sash Weight","Tube Length","Balance","Weight",null,"Sash Weight","Tube Length","Balance","Weight"]
[null,{"$f":"B3+1","v":5},3,"BN",null,2,"D",{"$f":"1.6*2","v":3.2},"Double Strength (3 mm)",null,{"$f":"ModelNo","v":"Select Model"},{"$f":"VLOOKUP(ModelNo,$K$5:$V$83,2,FALSE)","v":{"$error":"#N/A"}},{"$f":"VLOOKUP(ModelNo,$K$5:$V$83,3,FALSE)","v":{"$error":"#N/A"}},{"$f":"VLOOKUP(ModelNo,$K$5:$V$83,4,FALSE)","v":{"$error":"#N/A"}},{"$f":"VLOOKUP(ModelNo,$K$5:$V$83,5,FALSE)","v":{"$error":"#N/A"}},{"$f":"VLOOKUP(ModelNo,$K$5:$V$83,6,FALSE)","v":{"$error":"#N/A"}},{"$f":"VLOOKUP(ModelNo,$K$5:$V$83,7,FALSE)","v":{"$error":"#N/A"}},{"$f":"VLOOKUP(ModelNo,$K$5:$V$83,8,FALSE)","v":{"$error":"#N/A"}},{"$f":"VLOOKUP(ModelNo,$K$5:$V$83,9,FALSE)","v":{"$error":"#N/A"}},{"$f":"VLOOKUP(ModelNo,$K$5:$V$83,10,FALSE)","v":{"$error":"#N/A"}},{"$f":"VLOOKUP(ModelNo,$K$5:$V$83,11,FALSE)","v":{"$error":"#N/A"}},{"$f":"ROUND(((EH*EW)/144),3)","v":{"$error":"#N/A"}},null,"Displacement",{"$f":"IF($M$4>37.5,$M$4-36,0)","v":{"$error":"#N/A"}},null,null,"Top Top Rail",0,0,{"$f":"AC4*AD4","v":0},null,"Top Top Rail",0,0,{"$f":"AH4*AI4","v":0},null,null,{"$f":"TRUNC(TOP_WGT)","v":{"$error":"#N/A"}},{"$f":"AM9","v":{"$error":"#N/A"}},"Number","Range",null,{"$f":"TRUNC(BTM_WGT)","v":{"$error":"#N/A"}},{"$f":"AR9","v":{"$error":"#N/A"}},"Number","Range",null,null,0.75,null,"Climatech-4","Climatech-SC","Climatech-7","Climatech TG2",null,null,null,"Model","Top","Bott",null,null,null,null,{"$f":"TRUNC(TOP_WGT)","v":{"$error":"#N/A"}},{"$f":"TOPTUBELENGTH","v":{"$error":"#N/A"}},"Number","Range",null,{"$f":"TRUNC(BTM_WGT)","v":{"$error":"#N/A"}},{"$f":"BOTTUBELENGTH","v":{"$error":"#N/A"}},"Number","Range",null,null,null,"Model","GW","GH",null,"Max Short"]
[null,6,3,"BN",null,3,"T",{"$f":"2.408*2","v":4.8159999999999998},"Triple Strength (5 mm)",null,"A171",null,null,null,null,null,null,null,null,null,null,null,null,"Coil Loc. From CMR",{"$f":"IF(OR(ModelNo=\"A571\",ModelNo=\"A581\"),0,(($Y$3-1)*1.58)+$Y$4+$Q$4+1.5)","v":{"$error":"#N/A"}},null,null,"Top Bottom Rail",0,0,{"$f":"AC5*AD5","v":0},null,"Top Bottom Rail",0,0,{"$f":"AH5*AI5","v":0},null,null,"Balance Size",{"$f":"IF(AND(AO5>0,AP5>0),AO5,0)","v":{"$error":"#N/A"}},{"$f":"IF($AN$4<=7,7,0)","v":{"$error":"#N/A"}},{"$f":"IF(AND(AO5=7,$AM$4>=2,$AM$4<=2.99),AO5&\"-\"&\"1\",0)","v":{"$error":"#N/A"}},null,"Balance Size",{"$f":"IF(AND(AT5>0,AU5>0),AT5,0)","v":{"$error":"#N/A"}},{"$f":"IF($AS$4<=7,7,0)","v":{"$error":"#N/A"}},{"$f":"IF(AND(AT5=7,$AR$4>=2,$AR$4<=2.99),AT5&\"-\"&\"1\",0)","v":{"$error":"#N/A"}},null,{"$f":"IF(AY5>\"\",1,\"\")","v":""},"Outside Pane",{"$f":"IF(AND(EXT_2=1,Thickness_Select=1),\"Clear\",\"\")","v":""},{"$f":"IF(AND(EXT_2=1,Thickness_Select=1),\"SB60\",\"\")","v":""},{"$f":"IF(AND(EXT_2=1,Thickness_Select=1),\"SB60\",\"\")","v":""},{"$f":"IF(AND(EXT_2=1,Thickness_Select=1),\"SB60\",\"\")","v":""},null,null,"Standard",null,{"$f":"IF(ModelNo=\"7SH2\",\"7SH2\",IF(ModelNo=\"7SH3\",\"7SH3\",\"A571\"))","v":"A571"},null,{"$f":"VLOOKUP($M$4,$BG$48:$BJ$67,4)","v":{"$error":"#N/A"}},null,null,null,null,"Balance Size",{"$f":"IF(AND(BP5>0,BQ5>0),BP5,0)","v":{"$error":"#N/A"}},{"$f":"IF($BO$4<=6,6,0)","v":{"$error":"#N/A"}},{"$f":"IF(AND(BP5=6,$BN$4>=2,$BN$4<=5),BP5&\"A\",0)","v":{"$error":"#N/A"}},null,"Balance Size",{"$f":"IF(AND(BU5>0,BV5>0),BU5,0)","v":{"$error":"#N/A"}},{"$f":"IF($BT$4<=6,6,0)","v":{"$error":"#N/A"}},{"$f":"IF(AND(BU5=6,$BS$4>=2,$BS$4<=5),BU5&\"A\",0)","v":{"$error":"#N/A"}},null,null,null,"A270",{"$f":"Frame_Width-2.3125","v":-2.3125},{"$f":"Frame_Height-2.3125","v":-2.3125},{"$f":"MAX(CA5:CB5)","v":-2.3125},86.25]
[null,7,4,"RD",null,4,"STG",{"$f":"1.157*3","v":3.4710000000000001},"Triple IG Single Strrength",null,"A172",{"$f":"A172CDIM","v":0},{"$f":"A172CDIM+1.0625","v":1.0625},null,null,null,null,null,null,{"$f":"Frame_Width-L6-4","v":-4},{"$f":"Frame_Height-3","v":-3},null,null,null,null,null,null,"Top Stile",0,0,{"$f":"(AC6*AD6)/12","v":0},null,"Top Stile",0,0,{"$f":"(AH6*AI6)/12","v":0},null,null,{"$f":"VLOOKUP((MAX(AN5:AN235)),AN5:AP235,3,FALSE)","v":{"$error":"#N/A"}},{"$error":"#N/A"},{"$error":"#N/A"},{"$f":"IF(AND(AO6=7,$AM$4>=3,$AM$4<=3.99),AO6&\"-\"&\"2\",0)","v":{"$error":"#N/A"}},null,{"$f":"VLOOKUP((MAX(AS5:AS235)),AS5:AU235,3,FALSE)","v":{"$error":"#N/A"}},{"$error":"#N/A"},{"$error":"#N/A"},{"$f":"IF(AND(AT6=7,$AR$4>=3,$AR$4<=3.99),AT6&\"-\"&\"2\",0)","v":{"$error":"#N/A"}},null,{"$f":"IF(AY6>\"\",2,\"\")","v":""},"Middle Pane",{"$f":"IF(AND(EXT_2=1,Thickness_Select=1),\"N/A\",\"\")","v":""},{"$f":"IF(AND(EXT_2=1,Thickness_Select=1),\"N/A\",\"\")","v":""},{"$f":"IF(AND(EXT_2=1,Thickness_Select=1),\"N/A\",\"\")","v":""},{"$f":"IF(AND(EXT_2=1,Thickness_Select=1),\"N/A\",\"\")","v":""},null,null,"SolarTherm",null,{"$f":"IF(ModelNo=\"8SH2\",\"8SH2\",IF(ModelNo=\"8SH3\",\"8SH3\",\"A581\"))","v":"A581"},null,{"$f":"VLOOKUP($M$4,$BG$23:$BJ$42,4)","v":{"$error":"#N/A"}},null,null,null,null,{"$f":"VLOOKUP((MAX(BO5:BO229)),BO5:BQ229,3,FALSE)","v":{"$error":"#N/A"}},{"$error":"#N/A"},{"$error":"#N/A"},{"$f":"IF(AND(BP6=6,$BN$4>=6,$BN$4<=9),BP6&\"B\",0)","v":{"$error":"#N/A"}},null,{"$f":"VLOOKUP((MAX(BT5:BT229)),BT5:BV229,3,FALSE)","v":{"$error":"#N/A"}},{"$error":"#N/A"},{"$error":"#N/A"},{"$f":"IF(AND(BU6=6,$BS$4>=6,$BS$4<=9),BU6&\"B\",0)","v":{"$error":"#N/A"}},null,null,null,"A504",{"$f":"Frame_Width-4.625","v":-4.625},{"$f":"Frame_Height-4.625","v":-4.625},-4.625,86.5]
[null,8,4,"RD",null,5,"DTG",{"$f":"1.6*3","v":4.8000000000000007},"Triple IG Double Strength",null,"A173",{"$f":"A173CDIM","v":0.3125},{"$f":"A173CDIM+1.0625","v":1.375},null,null,null,null,null,null,{"$f":"Frame_Width-A173CDIM-M7-1.75","v":-3.4375},{"$f":"Frame_Height-3","v":-3},null,null,null,null,null,null,"Top Rail Reinf.",0,0,0,null,"Top Rail Reinf.",0,0,0,null,null,null,{"$error":"#N/A"},{"$error":"#N/A"},{"$f":"IF(AND(AO7=7,$AM$4>=4,$AM$4<=4.99),AO7&\"-\"&\"3\",0)","v":{"$error":"#N/A"}},null,null,{"$error":"#N/A"},{"$error":"#N/A"},{"$f":"IF(AND(AT7=7,$AR$4>=4,$AR$4<=4.99),AT7&\"-\"&\"3\",0)","v":{"$error":"#N/A"}},null,{"$f":"IF(AY7>\"\",3,\"\")","v":""},"Inside Pane",{"$f":"IF(AND(EXT_2=1,Thickness_Select=1),\"Clear\",\"\")","v":""},{"$f":"IF(AND(EXT_2=1,Thickness_Select=1),\"Clear\",\"\")","v":""},{"$f":"IF(AND(EXT_2=1,Thickness_Select=1),\"SB60\",\"\")","v":""},{"$f":"IF(AND(EXT_2=1,Thickness_Select=1),\"Clear\",\"\")","v":""},null,null,"SolarTherm-2",null,"82SP",null,{"$error":"#N/A"},null,null,null,null,null,{"$error":"#N/A"},{"$error":"#N/A"},{"$f":"IF(AND(BP7=6,$BN$4>=10,$BN$4<=12),BP7&\"C\",0)","v":{"$error":"#N/A"}},null,null,{"$error":"#N/A"},{"$error":"#N/A"},{"$f":"IF(AND(BU7=6,$BS$4>=10,$BS$4<=12),BU7&\"C\",0)","v":{"$error":"#N/A"}},null,null,null,"A570",{"$f":"Frame_Width-2.3125","v":-2.3125},{"$f":"Frame_Height-2.3125","v":-2.3125},-2.3125,86.25]
[null,9,5,"BU",null,6,"L",{"$f":"2.683*2","v":5.3659999999999997},"Laminated",null,"A175",{"$f":"A175CDIM","v":0.375},{"$f":"A175CDIM+1.0625","v":1.4375},null,null,null,null,null,null,{"$f":"Frame_Width-(M8*2)-(2.9*2)-1.01","v":-9.6850000000000005},{"$f":"Frame_Height-3","v":-3},null,null,null,null,null,null,"Top Stile Reinf",0,0,0,null,"Top Stile Reinf",0,0,0,null,null,"Top Tube length",{"$error":"#N/A"},{"$error":"#N/A"},{"$f":"IF(AND(AO8=7,$AM$4>=5,$AM$4<=5.99),AO8&\"-\"&\"4\",0)","v":{"$error":"#N/A"}},null,"Bott. Tube Length",{"$error":"#N/A"},{"$error":"#N/A"},{"$f":"IF(AND(AT8=7,$AR$4>=5,$AR$4<=5.99),AT8&\"-\"&\"4\",0)","v":{"$error":"#N/A"}},null,{"$f":"IF(AY8>\"\",4,\"\")","v":""},"Spacer",{"$f":"IF(AND(EXT_2=1,Thickness_Select=1),\"Intercept\",\"\")","v":""},{"$f":"IF(AND(EXT_2=1,Thickness_Select=1),\"Intercept\",\"\")","v":""},{"$f":"IF(AND(EXT_2=1,Thickness_Select=1),\"Intercept\",\"\")","v":""},{"$f":"IF(AND(EXT_2=1,Thickness_Select=1),\"SST\",\"\")","v":""},null,null,"SolarTherm Plus",null,"8SPS",null,{"$error":"#N/A"},null,null,null,null,null,{"$error":"#N/A"},{"$error":"#N/A"},{"$f":"IF(AND(BP8=6,$BN$4>=13,$BN$4<=15),BP8&\"D\",0)","v":{"$error":"#N/A"}},null,null,{"$error":"#N/A"},{"$error":"#N/A"},{"$f":"IF(AND(BU8=6,$BS$4>=13,$BS$4<=15),BU8&\"D\",0)","v":{"$error":"#N/A"}},null,null,null,"A770",{"$f":"Frame_Width-2.3125","v":-2.3125},{"$f":"Frame_Height-2.3125","v":-2.3125},-2.3125,86.25]
[null,10,5,"BU",null,null,null,null,1,null,"A191",null,null,null,null,null,null,null,null,null,null,null,null,null,null,null,null,"Top Glass",0,0,0,null,"Top Glass",0,0,0,null,null,{"$f":"TOPTUBELENGTH","v":{"$error":"#N/A"}},{"$error":"#N/A"},{"$error":"#N/A"},{"$f":"IF(AND(AO9=7,$AM$4>=6,$AM$4<=7.99),AO9&\"-\"&\"5\",0)","v":{"$error":"#N/A"}},null,{"$f":"BOTTUBELENGTH","v":{"$error":"#N/A"}},{"$error":"#N/A"},{"$error":"#N/A"},{"$f":"IF(AND(AT9=7,$AR$4>=6,$AR$4<=7.99),AT9&\"-\"&\"5\",0)","v":{"$error":"#N/A"}},null,{"$f":"IF(AY9>\"\",5,\"\")","v":""},"Gas",{"$f":"IF(AND(EXT_2=1,Thickness_Select=1),\"Air\",\"\")","v":""},{"$f":"IF(AND(EXT_2=1,Thickness_Select=1),\"Argon\",\"\")","v":""},{"$f":"IF(AND(EXT_2=1,Thickness_Select=1),\"Argon\",\"\")","v":""},{"$f":"IF(AND(EXT_2=1,Thickness_Select=1),\"Argon\",\"\")","v":""},null,null,2,null,"8SPP",null,{"$error":"#N/A"},null,null,null,null,null,{"$error":"#N/A"},{"$error":"#N/A"},{"$f":"IF(AND(BP9=6,$BN$4>=16,$BN$4<=20),BP9&\"E\",0)","v":{"$error":"#N/A"}},null,null,{"$error":"#N/A"},{"$error":"#N/A"},{"$f":"IF(AND(BU9=6,$BS$4>=16,$BS$4<=20),BU9&\"E\",0)","v":{"$error":"#N/A"}},null,null,null,"A280",{"$f":"Frame_Width-2.5625","v":-2.5625},{"$f":"Frame_Height-2.5625","v":-2.5625},-2.5625,86.5]
[null,11,6,"YW",null,null,null,{"$f":"VLOOKUP(Glass,F3:H10,3,FALSE)","v":2.3140000000000001},{"$f":"VLOOKUP(Glass,F3:H10,2,FALSE)","v":"S"},null,"A192",{"$f":"A192CDIM","v":0},{"$f":"A192CDIM-1.75","v":-1.75},null,null,null,null,null,null,null,null,null,null,null,null,null,null,"Top Spacer",0,0,0,null,"Top Spacer",0,0,0,null,null,null,{"$error":"#N/A"},{"$error":"#N/A"},{"$f":"IF(AND(AO10=7,$AM$4>=8,$AM$4<=9.99),AO10&\"-\"&\"9\",0)","v":{"$error":"#N/A"}},null,null,{"$error":"#N/A"},{"$error":"#N/A"},{"$f":"IF(AND(AT10=7,$AR$4>=8,$AR$4<=9.99),AT10&\"-\"&\"9\",0)","v":{"$error":"#N/A"}},null,{"$f":"IF(AY10>\"\",6,\"\")","v":""},"R-Value",{"$f":"IF(AND(EXT_2=1,Thickness_Select=1),\"2.04\",\"\")","v":""},{"$f":"IF(AND(EXT_2=1,Thickness_Select=1),4,\"\")","v":""},{"$f":"IF(AND(EXT_2=1,Thickness_Select=1),4.17,\"\")","v":""},{"$f":"IF(AND(EXT_2=1,Thickness_Select=1),4,\"\")","v":""},null,null,null,null,"8POS",null,{"$error":"#N/A"},null,null,null,null,null,{"$error":"#N/A"},{"$error":"#N/A"},{"$f":"IF(AND(BP10=6,$BN$4>=21,$BN$4<=24),\"Dbl.\"&BP10&\"C\",0)","v":{"$error":"#N/A"}},null,null,{"$error":"#N/A"},{"$error":"#N/A"},{"$f":"IF(AND(BU10=6,$BS$4>=21,$BS$4<=24),\"Dbl.\"&BU10&\"C\",0)","v":{"$error":"#N/A"}},null,null,null,"A580",{"$f":"Frame_Width-2.5625","v":-2.5625},{"$f":"Frame_Height-2.5625","v":-2.5625},-2.5625,86.5]
[null,12,6,"YW",null,null,null,null,null,null,"A193",null,null,null,null,null,null,null,null,null,null,null,null,{"$f":"IF(AND(OR(ModelNo=\"A140\",ModelNo=\"A144\",ModelNo=\"A146\",ModelNo=\"A740\",ModelNo=\"A744\",ModelNo=\"A746\",ModelNo=\"A840\",ModelNo=\"A844\",ModelNo=\"A846\"),EH<6),1,0)","v":{"$error":"#N/A"}},"SHATERROR",null,null,"Top Hardware",0,0,0,null,"Top Hardware",0,0,0,null,null,null,{"$error":"#N/A"},{"$error":"#N/A"},{"$f":"IF(AND(AO11=7,$AM$4>=10,$AM$4<=13.99),AO11&\"-\"&\"11\",0)","v":{"$error":"#N/A"}},null,null,{"$error":"#N/A"},{"$error":"#N/A"},{"$f":"IF(AND(AT11=7,$AR$4>=10,$AR$4<=13.99),AT11&\"-\"&\"11\",0)","v":{"$error":"#N/A"}},null,{"$f":"IF(AY11>\"\",7,\"\")","v":""},"U-Value",{"$f":"IF(AND(EXT_2=1,Thickness_Select=1),\"0.49\",\"\")","v":""},{"$f":"IF(AND(EXT_2=1,Thickness_Select=1),0.25,\"\")","v":""},{"$f":"IF(AND(EXT_2=1,Thickness_Select=1),0.24,\"\")","v":""},{"$f":"IF(AND(EXT_2=1,Thickness_Select=1),0.24,\"\")","v":""},null,null,"Glass Thickness",null,"8SOP",null,{"$error":"#N/A"},null,null,null,null,null,{"$error":"#N/A"},{"$error":"#N/A"},{"$f":"IF(AND(BP11=6,$BN$4>=25,$BN$4<=30),\"Dbl.\"&BP11&\"D\",0)","v":{"$error":"#N/A"}},null,null,{"$error":"#N/A"},{"$error":"#N/A"},{"$f":"IF(AND(BU11=6,$BS$4>=25,$BS$4<=30),\"Dbl.\"&BU11&\"D\",0)","v":{"$error":"#N/A"}},null,null,null,"A780",{"$f":"Frame_Width-2.5625","v":-2.5625},{"$f":"Frame_Height-2.5625","v":-2.5625},-2.5625,86.5]
[null,13,7,"GN",null,null,null,null,"Extrusion",null,"A194",null,null,null,null,null,null,null,null,null,null,null,null,{"$f":"IF(OR(ModelNo=\"A140\",ModelNo=\"A144\",ModelNo=\"A146\"),A140RADIUS,IF(OR(ModelNo=\"A740\",ModelNo=\"A744\",ModelNo=\"A746\"),A740RADIUS,IF(OR(ModelNo=\"A840\",ModelNo=\"A844\",ModelNo=\"A846\"),A840RADIUS,0)))","v":0},"SHATRADIUS",null,null,"Top Bead",0,0,0,null,"Top Bead",0,0,0,null,null,null,{"$error":"#N/A"},{"$error":"#N/A"},{"$f":"IF(AND(AO12=7,$AM$4>=14,$AM$4<=18),AO12&\"-\"&\"12\",0)","v":{"$error":"#N/A"}},null,null,{"$error":"#N/A"},{"$error":"#N/A"},{"$f":"IF(AND(AT12=7,$AR$4>=14,$AR$4<=18),AT12&\"-\"&\"12\",0)","v":{"$error":"#N/A"}},null,{"$f":"IF(AY12>\"\",8,\"\")","v":""},"Visible Light Transmittance",{"$f":"IF(AND(EXT_2=1,Thickness_Select=1),\"81%\",\"\")","v":""},{"$f":"IF(AND(EXT_2=1,Thickness_Select=1),\"71%\",\"\")","v":""},{"$f":"IF(AND(EXT_2=1,Thickness_Select=1),\"62%\",\"\")","v":""},{"$f":"IF(AND(EXT_2=1,Thickness_Select=1),\"71%\",\"\")","v":""},null,null,{"$f":"IF(EXT_2=1,\"3/4\"\"\",IF(EXT_2=4,\"7/8\"\"\",IF(EXT_2=5,\"1\"\"\",\"13/16\"\"\")))","v":"13/16\""},null,"8PS3",{"$f":"VLOOKUP($N$4,$BG$23:$BJ$42,4)","v":{"$error":"#N/A"}},{"$error":"#N/A"},null,null,null,null,null,{"$error":"#N/A"},{"$error":"#N/A"},{"$f":"IF(AND(BP12=6,$BN$4>=31,$BN$4<=40),\"Dbl.\"&BP12&\"E\",0)","v":{"$error":"#N/A"}},null,null,{"$error":"#N/A"},{"$error":"#N/A"},{"$f":"IF(AND(BU12=6,$BS$4>=31,$BS$4<=40),\"Dbl.\"&BU12&\"E\",0)","v":{"$error":"#N/A"}},null,null,null,"A390",{"$f":"Frame_Width-2.5625","v":-2.5625},{"$f":"Frame_Height-2.5625","v":-2.5625},-2.5625,86.5]
[null,14,7,"GN",null,null,null,1,{"$f":"IF(EXT_1=0,\"\",EXT_1)","v":""},null,"A195",null,null,null,null,null,null,null,null,null,null,null,null,{"$f":"VLOOKUP(EXTRUSION,X15:Y24,2,FALSE)","v":{"$error":"#N/A"}},"MINRADIUS",null,null,"Bottom Top Rail",{"$f":"(Frame_Width-2.125)/12","v":-0.17708333333333334},0.24299999999999999,{"$f":"AC13*AD13","v":-4.303125E-2},null,"Bottom Top Rail",{"$f":"(Frame_Width-2.125)/12","v":-0.17708333333333334},0.35499999999999998,{"$f":"AH13*AI13","v":-6.2864583333333335E-2},null,null,null,{"$f":"IF(AND(AO13>0,AP13>0),AO13,0)","v":{"$error":"#N/A"}},{"$f":"IF(AND($AN$4<=9,$AN$4>7),9,0)","v":{"$error":"#N/A"}},{"$f":"IF(AND(AO13=9,$AM$4>=3,$AM$4<=4.99),AO13&\"-\"&\"1\",0)","v":{"$error":"#N/A"}},null,null,{"$f":"IF(AND(AT13>0,AU13>0),AT13,0)","v":{"$error":"#N/A"}},{"$f":"IF(AND($AS$4<=9,$AS$4>7),9,0)","v":{"$error":"#N/A"}},{"$f":"IF(AND(AT13=9,$AR$4>=3,$AR$4<=4.99),AT13&\"-\"&\"1\",0)","v":{"$error":"#N/A"}},null,{"$f":"IF(AY13>\"\",9,\"\")","v":""},"Ultraviolet Light Transmittance",{"$f":"IF(AND(EXT_2=1,Thickness_Select=1),\"58%\",\"\")","v":""},{"$f":"IF(AND(EXT_2=1,Thickness_Select=1),\"16%\",\"\")","v":""},{"$f":"IF(AND(EXT_2=1,Thickness_Select=1),\"5%\",\"\")","v":""},{"$f":"IF(AND(EXT_2=1,Thickness_Select=1),\"16%\",\"\")","v":""},null,null,{"$f":"IF(EXT_2=1,\"13/16\"\"\",IF(EXT_2=3,\"1\"\"\",\"\"))","v":""},null,"8SP3",{"$f":"VLOOKUP($N$4,$BG$23:$BJ$42,4)","v":{"$error":"#N/A"}},{"$error":"#N/A"},null,null,null,null,null,{"$error":"#N/A"},{"$f":"IF(AND($BO$4<=8,$BO$4>6),8,0)","v":{"$error":"#N/A"}},{"$f":"IF(AND(BP13=8,$BN$4>=2,$BN$4<=6),BP13&\"A\",0)","v":{"$error":"#N/A"}},null,null,{"$error":"#N/A"},{"$f":"IF(AND($BT$4<=8,$BT$4>6),8,0)","v":{"$error":"#N/A"}},{"$f":"IF(AND(BU13=8,$BS$4>=2,$BS$4<=6),BU13&\"A\",0)","v":{"$error":"#N/A"}},null,null,null,"A990",{"$f":"Frame_Width-2.5625","v":-2.5625},{"$f":"Frame_Height-2.5625","v":-2.5625},-2.5625,86.5]
[null,15,8,"LG",null,null,null,2,{"$f":"IF(EXT_2=0,\"\",EXT_2)","v":""},null,"B191",null,null,null,null,null,null,null,null,null,null,null,null,null,null,null,null,"Bottom Bottom Rail",{"$f":"(Frame_Width-2.125)/12","v":-0.17708333333333334},0.216,-3.8249999999999999E-2,null,"Bottom Bottom Rail",{"$f":"(Frame_Width-2.8125)/12","v":-0.234375},0.35499999999999998,-8.3203124999999989E-2,null,null,null,{"$error":"#N/A"},{"$error":"#N/A"},{"$f":"IF(AND(AO14=9,$AM$4>=5,$AM$4<=6.99),AO14&\"-\"&\"2\",0)","v":{"$error":"#N/A"}},null,null,{"$error":"#N/A"},{"$error":"#N/A"},{"$f":"IF(AND(AT14=9,$AR$4>=5,$AR$4<=6.99),AT14&\"-\"&\"2\",0)","v":{"$error":"#N/A"}},"x",{"$f":"IF(AY14>\"\",10,\"\")","v":""},"Solar Heat Gain Coefficient",{"$f":"IF(AND(EXT_2=1,Thickness_Select=1),\"0.75\",\"\")","v":""},{"$f":"IF(AND(EXT_2=1,Thickness_Select=1),0.38,\"\")","v":""},{"$f":"IF(AND(EXT_2=1,Thickness_Select=1),0.36,\"\")","v":""},{"$f":"IF(AND(EXT_2=1,Thickness_Select=1),0.38,\"\")","v":""},null,null,1,null,"A991",null,{"$error":"#N/A"},null,null,null,null,null,{"$error":"#N/A"},{"$error":"#N/A"},{"$f":"IF(AND(BP14=8,$BN$4>=7,$BN$4<=10),BP14&\"B\",0)","v":{"$error":"#N/A"}},null,null,{"$error":"#N/A"},{"$error":"#N/A"},{"$f":"IF(AND(BU14=8,$BS$4>=7,$BS$4<=10),BU14&\"B\",0)","v":{"$error":"#N/A"}},null,null,null,null,{"$f":"Frame_Width-4.125","v":-4.125},{"$f":"Frame_Height-4.125","v":-4.125},-4.125]
[null,16,8,"LG",null,null,null,3,{"$f":"IF(EXT_3=0,\"\",EXT_3)","v":""},null,"B192",null,null,null,null,null,null,null,null,null,null,null,null,"Mezzo",12.5,null,null,"Bottom Stile",{"$f":"((A571CDIM-0.875)*2)/12","v":-0.14583333333333334},0.185,-2.6979166666666669E-2,null,"Bottom Stile",{"$f":"((A581CDIM-1.5)*2)/12","v":-0.25},0.36099999999999999,-9.0249999999999997E-2,null,null,null,{"$error":"#N/A"},{"$error":"#N/A"},{"$f":"IF(AND(AO15=9,$AM$4>=7,$AM$4<=8.99),AO15&\"-\"&\"3\",0)","v":{"$error":"#N/A"}},null,null,{"$error":"#N/A"},{"$error":"#N/A"},{"$f":"IF(AND(AT15=9,$AR$4>=7,$AR$4<=8.99),AT15&\"-\"&\"3\",0)","v":{"$error":"#N/A"}},null,null,"13/16",null,null,null,null,null,null,null,null,"A501",{"$f":"VLOOKUP($N$4,$BG$23:$BJ$42,4)","v":{"$error":"#N/A"}},{"$error":"#N/A"},null,null,null,null,null,{"$error":"#N/A"},{"$error":"#N/A"},{"$f":"IF(AND(BP15=8,$BN$4>=11,$BN$4<=13),BP15&\"C\",0)","v":{"$error":"#N/A"}},null,null,{"$error":"#N/A"},{"$error":"#N/A"},{"$f":"IF(AND(BU15=8,$BS$4>=11,$BS$4<=13),BU15&\"C\",0)","v":{"$error":"#N/A"}},null,null,null,null,{"$f":"Frame_Width-5.5625","v":-5.5625},{"$f":"Frame_Height-7.4375","v":-7.4375},-5.5625]
[null,17,9,"NAT",null,null,null,4,{"$f":"IF(EXT_4=0,\"\",EXT_4)","v":""},null,"B193",null,null,null,null,null,null,null,null,null,null,null,null,"Mezzo/N.F",13,null,null,"Bottom Rail Reinf.",{"$f":"((AC13*12)-3)/12","v":-0.42708333333333331},0.17199999999999999,-7.345833333333332E-2,null,"Bottom Rail Reinf.",{"$f":"((AH13*12)-2.6875)/12","v":-0.40104166666666669},0.13800000000000001,-5.5343750000000004E-2,null,null,null,{"$error":"#N/A"},{"$error":"#N/A"},{"$f":"IF(AND(AO16=9,$AM$4>=9,$AM$4<=10.99),AO16&\"-\"&\"4\",0)","v":{"$error":"#N/A"}},null,null,{"$error":"#N/A"},{"$error":"#N/A"},{"$f":"IF(AND(AT16=9,$AR$4>=9,$AR$4<=10.99),AT16&\"-\"&\"4\",0)","v":{"$error":"#N/A"}},null,{"$f":"IF(AY16>\"\",1,\"\")","v":""},"Outside Pane",{"$f":"IF(OR(AND(EXT_2=1,Thickness_Select=2),AND(OR(EXT_2=2,EXT_2=3),Thickness_Select=1)),\"Clear\",\"\")","v":""},{"$f":"IF(OR(AND(EXT_2=1,Thickness_Select=2),AND(OR(EXT_2=2,EXT_2=3),Thickness_Select=1)),\"SB60\",\"\")","v":""},{"$f":"IF(OR(AND(EXT_2=1,Thickness_Select=2),AND(OR(EXT_2=2,EXT_2=3),Thickness_Select=1)),\"SB60\",\"\")","v":""},{"$f":"IF(OR(AND(EXT_2=1,Thickness_Select=2),AND(OR(EXT_2=2,EXT_2=3),Thickness_Select=1)),\"SB60\",\"\")","v":""},null,null,null,null,{"$f":"ModelNo","v":"Select Model"},{"$f":"VLOOKUP($BG$16,$BG$5:$BI$15,2,FALSE)","v":{"$error":"#N/A"}},{"$f":"VLOOKUP($BG$16,$BG$5:$BI$15,3,FALSE)","v":{"$error":"#N/A"}},null,null,null,null,null,{"$error":"#N/A"},{"$error":"#N/A"},{"$f":"IF(AND(BP16=8,$BN$4>=14,$BN$4<=15),BP16&\"D\",0)","v":{"$error":"#N/A"}},null,null,{"$error":"#N/A"},{"$error":"#N/A"},{"$f":"IF(AND(BU16=8,$BS$4>=14,$BS$4<=15),BU16&\"D\",0)","v":{"$error":"#N/A"}},null,null,null,null,{"$f":"Frame_Width-5.5625","v":-5.5625},{"$f":"Frame_Height-5.5625","v":-5.5625},-5.5625]
[null,18,9,"NAT",null,null,null,5,{"$f":"IF(EXT_5=0,\"\",EXT_5)","v":""},null,"B194",null,null,null,null,null,null,null,null,null,null,null,null,"Mezzo w/Stucco",13.5,null,null,"Bottom Stile Reinf.",null,null,0,null,"Bottom Stile Reinf.",null,null,0,null,null,null,{"$error":"#N/A"},{"$error":"#N/A"},{"$f":"IF(AND(AO17=9,$AM$4>=11,$AM$4<=11.99),AO17&\"-\"&\"5\",0)","v":{"$error":"#N/A"}},null,null,{"$error":"#N/A"},{"$error":"#N/A"},{"$f":"IF(AND(AT17=9,$AR$4>=11,$AR$4<=11.99),AT17&\"-\"&\"5\",0)","v":{"$error":"#N/A"}},null,{"$f":"IF(AY17>\"\",2,\"\")","v":""},"Middle Pane",{"$f":"IF(OR(AND(EXT_2=1,Thickness_Select=2),AND(OR(EXT_2=2,EXT_2=3),Thickness_Select=1)),\"N/A\",\"\")","v":""},{"$f":"IF(OR(AND(EXT_2=1,Thickness_Select=2),AND(OR(EXT_2=2,EXT_2=3),Thickness_Select=1)),\"N/A\",\"\")","v":""},{"$f":"IF(OR(AND(EXT_2=1,Thickness_Select=2),AND(OR(EXT_2=2,EXT_2=3),Thickness_Select=1)),\"N/A\",\"\")","v":""},{"$f":"IF(OR(AND(EXT_2=1,Thickness_Select=2),AND(OR(EXT_2=2,EXT_2=3),Thickness_Select=1)),\"N/A\",\"\")","v":""},null,null,null,null,null,null,null,null,null,null,null,null,{"$error":"#N/A"},{"$error":"#N/A"},{"$f":"IF(AND(BP17=8,$BN$4>=16,$BN$4<=18),BP17&\"E\",0)","v":{"$error":"#N/A"}},null,null,{"$error":"#N/A"},{"$error":"#N/A"},{"$f":"IF(AND(BU17=8,$BS$4>=16,$BS$4<=18),BU17&\"E\",0)","v":{"$error":"#N/A"}},null,null,null,"A680",null,null,{"$f":"MAX(CC14:CC16)","v":-4.125},88]
[null,19,10,"PK",null,null,null,null,1,{"$f":"VLOOKUP(EXTSELECT,H13:I17,2,FALSE)","v":""},"B195",null,null,null,null,null,null,null,null,null,null,null,null,"70 Series 1-3/8\" NFS",11.75,null,null,"Bottom Glass",{"$f":"((A571CDIM-3.0625)*(Frame_Width-4.3125))/144","v":9.1715494791666671E-2},{"$f":"$H$10","v":2.3140000000000001},0.21222965494791668,null,"Bottom Glass",{"$f":"((A581CDIM-4)*(Frame_Width-5.3125))/144","v":0.14756944444444445},{"$f":"$H$10","v":2.3140000000000001},0.34147569444444448,null,null,null,{"$error":"#N/A"},{"$error":"#N/A"},{"$f":"IF(AND(AO18=9,$AM$4>=12,$AM$4<=12.99),AO18&\"-\"&\"6\",0)","v":{"$error":"#N/A"}},null,null,{"$error":"#N/A"},{"$error":"#N/A"},{"$f":"IF(AND(AT18=9,$AR$4>=12,$AR$4<=12.99),AT18&\"-\"&\"6\",0)","v":{"$error":"#N/A"}},null,{"$f":"IF(AY18>\"\",3,\"\")","v":""},"Inside Pane",{"$f":"IF(OR(AND(EXT_2=1,Thickness_Select=2),AND(OR(EXT_2=2,EXT_2=3),Thickness_Select=1)),\"Clear\",\"\")","v":""},{"$f":"IF(OR(AND(EXT_2=1,Thickness_Select=2),AND(OR(EXT_2=2,EXT_2=3),Thickness_Select=1)),\"Clear\",\"\")","v":""},{"$f":"IF(OR(AND(EXT_2=1,Thickness_Select=2),AND(OR(EXT_2=2,EXT_2=3),Thickness_Select=1)),\"SB60\",\"\")","v":""},{"$f":"IF(OR(AND(EXT_2=1,Thickness_Select=2),AND(OR(EXT_2=2,EXT_2=3),Thickness_Select=1)),\"Clear\",\"\")","v":""},null,null,null,null,null,null,null,null,null,null,null,null,{"$error":"#N/A"},{"$error":"#N/A"},{"$f":"IF(AND(BP18=8,$BN$4>=19,$BN$4<=20),\"Dbl.\"&BP18&\"B\",0)","v":{"$error":"#N/A"}},null,null,{"$error":"#N/A"},{"$error":"#N/A"},{"$f":"IF(AND(BU18=8,$BS$4>=19,$BS$4<=20),\"Dbl.\"&BU18&\"B\",0)","v":{"$error":"#N/A"}},null,null,null,null,{"$f":"Frame_Width-4.125","v":-4.125},{"$f":"Frame_Height-4.125","v":-4.125},{"$f":"MAX(CA18:CB18)","v":-4.125}]
[null,20,10,"PK",null,null,null,null,{"$f":"VLOOKUP(EXTSELECT,H13:I17,2,FALSE)","v":""},null,"A201",{"$f":"A201CDIM","v":0},{"$f":"A201CDIM-0.5625","v":-0.5625},null,{"$f":"$AE$45","v":0},{"$f":"AE44","v":0},1.3125,7.3125,1.75,{"$f":"Frame_Width-4.406","v":-4.4059999999999997},{"$f":"IF(TRUNC((Frame_Height-M19-R19)*16+0.5)/16<(TRUNC((L19-$Y$5-S19)*16+0.5)/16),TRUNC((Frame_Height-M19-R19)*16+0.5)/16,TRUNC((L19-$Y$5-S19)*16+0.5)/16)","v":{"$error":"#N/A"}},null,null,"80 Series 1-3/8\" NFS",11.75,null,null,"Bottom Spacer",{"$f":"(((A571CDIM-3.0625)*2)+((Frame_Width-4.3125)*2))/12","v":-1.2291666666666667},5.3600000000000002E-2,{"$f":"AC19*AD19","v":-6.5883333333333335E-2},null,"Bottom Spacer",{"$f":"(((A581CDIM-4)*2)+((Frame_Width-5.3125)*2))/12","v":-1.5520833333333333},5.3600000000000002E-2,{"$f":"AH19*AI19","v":-8.3191666666666664E-2},null,null,null,{"$error":"#N/A"},{"$error":"#N/A"},{"$f":"IF(AND(AO19=9,$AM$4>=13,$AM$4<=14.99),AO19&\"-\"&\"9\",0)","v":{"$error":"#N/A"}},null,null,{"$error":"#N/A"},{"$error":"#N/A"},{"$f":"IF(AND(AT19=9,$AR$4>=13,$AR$4<=14.99),AT19&\"-\"&\"9\",0)","v":{"$error":"#N/A"}},null,{"$f":"IF(AY19>\"\",4,\"\")","v":""},"Spacer",{"$f":"IF(OR(AND(EXT_2=1,Thickness_Select=2),AND(OR(EXT_2=2,EXT_2=3),Thickness_Select=1)),\"Intercept\",\"\")","v":""},{"$f":"IF(OR(AND(EXT_2=1,Thickness_Select=2),AND(OR(EXT_2=2,EXT_2=3),Thickness_Select=1)),\"Intercept\",\"\")","v":""},{"$f":"IF(OR(AND(EXT_2=1,Thickness_Select=2),AND(OR(EXT_2=2,EXT_2=3),Thickness_Select=1)),\"Intercept\",\"\")","v":""},{"$f":"IF(OR(AND(EXT_2=1,Thickness_Select=2),AND(OR(EXT_2=2,EXT_2=3),Thickness_Select=1)),\"SST\",\"\")","v":""},null,null,null,null,null,null,null,null,null,null,null,null,{"$error":"#N/A"},{"$error":"#N/A"},{"$f":"IF(AND(BP19=8,$BN$4>=21,$BN$4<=26),\"Dbl.\"&BP19&\"C\",0)","v":{"$error":"#N/A"}},null,null,{"$error":"#N/A"},{"$error":"#N/A"},{"$f":"IF(AND(BU19=8,$BS$4>=21,$BS$4<=26),\"Dbl.\"&BU19&\"C\",0)","v":{"$error":"#N/A"}},null,null,null,null,{"$f":"Frame_Width-5.5625","v":-5.5625},{"$f":"Frame_Height-7.4375","v":-7.4375},{"$f":"MAX(CA19:CB19)","v":-5.5625}]
[null,21,56,"BU",null,null,null,"Offset >>",{"$f":"Offset","v":0},null,"A202",{"$f":"A202CDIM","v":0},{"$f":"A202CDIM-0.625","v":-0.625},null,null,null,null,null,null,{"$f":"Frame_Width-(A202DDIM+4.875)","v":-4.875},{"$f":"Frame_Height-(2.177*2)","v":-4.3540000000000001},null,null,"70 Seires 7/8\" NFS",11.75,null,null,"Bottom Hardware",1,0.36,{"$f":"AC20*AD20","v":0.36},null,"Bottom Hardware",1,0.36,{"$f":"AH20*AI20","v":0.36},null,null,null,{"$error":"#N/A"},{"$error":"#N/A"},{"$f":"IF(AND(AO20=9,$AM$4>=15,$AM$4<=17.99),AO20&\"-\"&\"11\",0)","v":{"$error":"#N/A"}},null,null,{"$error":"#N/A"},{"$error":"#N/A"},{"$f":"IF(AND(AT20=9,$AR$4>=15,$AR$4<=17.99),AT20&\"-\"&\"11\",0)","v":{"$error":"#N/A"}},null,{"$f":"IF(AY20>\"\",5,\"\")","v":""},"Gas",{"$f":"IF(OR(AND(EXT_2=1,Thickness_Select=2),AND(OR(EXT_2=2,EXT_2=3),Thickness_Select=1)),\"Air\",\"\")","v":""},{"$f":"IF(OR(AND(EXT_2=1,Thickness_Select=2),AND(OR(EXT_2=2,EXT_2=3),Thickness_Select=1)),\"Argon\",\"\")","v":""},{"$f":"IF(OR(AND(EXT_2=1,Thickness_Select=2),AND(OR(EXT_2=2,EXT_2=3),Thickness_Select=1)),\"Argon\",\"\")","v":""},{"$f":"IF(OR(AND(EXT_2=1,Thickness_Select=2),AND(OR(EXT_2=2,EXT_2=3),Thickness_Select=1)),\"Argon\",\"\")","v":""},null,null,null,null,"CALDWELL BALANCE CHART A581",null,null,null,null,null,null,null,{"$error":"#N/A"},{"$error":"#N/A"},{"$f":"IF(AND(BP20=8,$BN$4>=27,$BN$4<=32),\"Dbl.\"&BP20&\"D\",0)","v":{"$error":"#N/A"}},null,null,{"$error":"#N/A"},{"$error":"#N/A"},{"$f":"IF(AND(BU20=8,$BS$4>=27,$BS$4<=32),\"Dbl.\"&BU20&\"D\",0)","v":{"$error":"#N/A"}},null,null,null,null,{"$f":"Frame_Width-5.5625","v":-5.5625},{"$f":"Frame_Height-5.5625","v":-5.5625},{"$f":"MAX(CA20:CB20)","v":-5.5625}]
[null,22,56,"BU",null,null,null,"EXT_MESSAGE >>",{"$f":"IF(AND(EXTSELECT=1,OR(SELECTEXT=\"Select Reinforcement\",SELECTEXT=\"Select Extrusion\",SELECTEXT=\"Operator Position\")),\"<< Must Select\",\"\")","v":""},null,"A203",{"$f":"A203CDIM","v":0.6875},{"$f":"A203CDIM-0.4375","v":0.25},null,null,null,null,null,null,{"$f":"(Frame_Width-(A203DDIM+4.229))/2","v":-1.45825},{"$f":"Frame_Height-(2.177*2)","v":-4.3540000000000001},null,null,"80 Series 1\" NFS",11.75,null,null,"Bottom Bead",{"$f":"(((Frame_Width-4)*2)+((A571CDIM-2.75)*2))/12","v":-1.125},1.9E-2,{"$f":"AC21*AD21","v":-2.1374999999999998E-2},null,"Bottom Bead",{"$f":"(((Frame_Width-5.0625)*2)+((A581CDIM-3.75)*2))/12","v":-1.46875},1.9E-2,{"$f":"AH21*AI21","v":-2.790625E-2},null,null,null,{"$f":"IF(AND(AO21>0,AP21>0),AO21,0)","v":{"$error":"#N/A"}},{"$error":"#N/A"},{"$f":"IF(AND(AO21=9,$AM$4>=18,$AM$4<=22),AO21&\"-\"&\"12\",0)","v":{"$error":"#N/A"}},null,null,{"$error":"#N/A"},{"$error":"#N/A"},{"$f":"IF(AND(AT21=9,$AR$4>=18,$AR$4<=22),AT21&\"-\"&\"12\",0)","v":{"$error":"#N/A"}},null,{"$f":"IF(AY21>\"\",6,\"\")","v":""},"R-Value",{"$f":"IF(OR(AND(EXT_2=1,Thickness_Select=2),AND(OR(EXT_2=2,EXT_2=3),Thickness_Select=1)),\"2.04\",\"\")","v":""},{"$f":"IF(OR(AND(EXT_2=1,Thickness_Select=2),AND(OR(EXT_2=2,EXT_2=3),Thickness_Select=1)),4.17,\"\")","v":""},{"$f":"IF(OR(AND(EXT_2=1,Thickness_Select=2),AND(OR(EXT_2=2,EXT_2=3),Thickness_Select=1)),4.17,\"\")","v":""},{"$f":"IF(OR(AND(EXT_2=1,Thickness_Select=2),AND(OR(EXT_2=2,EXT_2=3),Thickness_Select=1)),4.17,\"\")","v":""},null,null,null,null,"SASH HEIGHT",null,null,"Balance",null,null,null,null,{"$error":"#N/A"},{"$error":"#N/A"},{"$f":"IF(AND(BP21=8,$BN$4>=33,$BN$4<=36),\"Dbl.\"&BP21&\"E\",0)","v":{"$error":"#N/A"}},null,null,{"$error":"#N/A"},{"$error":"#N/A"},{"$f":"IF(AND(BU21=8,$BS$4>=33,$BS$4<=36),\"Dbl.\"&BU21&\"E\",0)","v":{"$error":"#N/A"}},null,null,null,"A690",null,null,{"$f":"MAX(CC18:CC20)","v":-4.125},88]
[null,23,66,"YW",null,null,null,"LEG_MESSAGE >>",{"$f":"IF(AND(EXT_CONTROL=0,W>0,H>0,LEG>0),\"<< Not a Valid Entry\",IF(AND(EXT_CONTROL=1,W>0,H>0,LEG=0),\"<< Need Leg Height\",IF(AND(OR(ModelNo=\"A140\",ModelNo=\"A740\",ModelNo=\"A840\"),W>0,H>0,LEG<>(Frame_Height-(Frame_Width/2))),\"<< Leg Should be\"&\" \"&(Frame_Height-(Frame_Width/2)),\"\")))","v":""},null,"A204",null,null,null,null,null,null,null,null,null,null,null,null,"J-Channel",11.75,null,null,null,null,"Top Sash",0,null,null,null,"Top Sash",0,null,null,null,{"$error":"#N/A"},{"$f":"IF(AND($AN$4<=11,$AN$4>9),11,0)","v":{"$error":"#N/A"}},{"$f":"IF(AND(AO22=11,$AM$4>=3,$AM$4<=4.99),AO22&\"-\"&\"1\",0)","v":{"$error":"#N/A"}},null,null,{"$error":"#N/A"},{"$f":"IF(AND($AS$4<=11,$AS$4>9),11,0)","v":{"$error":"#N/A"}},{"$f":"IF(AND(AT22=11,$AR$4>=3,$AR$4<=4.99),AT22&\"-\"&\"1\",0)","v":{"$error":"#N/A"}},null,{"$f":"IF(AY22>\"\",7,\"\")","v":""},"U-Value",{"$f":"IF(OR(AND(EXT_2=1,Thickness_Select=2),AND(OR(EXT_2=2,EXT_2=3),Thickness_Select=1)),\"0.49\",\"\")","v":""},{"$f":"IF(OR(AND(EXT_2=1,Thickness_Select=2),AND(OR(EXT_2=2,EXT_2=3),Thickness_Select=1)),0.24,\"\")","v":""},{"$f":"IF(OR(AND(EXT_2=1,Thickness_Select=2),AND(OR(EXT_2=2,EXT_2=3),Thickness_Select=1)),0.24,\"\")","v":""},{"$f":"IF(OR(AND(EXT_2=1,Thickness_Select=2),AND(OR(EXT_2=2,EXT_2=3),Thickness_Select=1)),0.24,\"\")","v":""},null,null,null,null,"RANGE",null,null,"Length",null,null,null,null,{"$error":"#N/A"},{"$f":"IF(AND($BO$4<=10,$BO$4>8),10,0)","v":{"$error":"#N/A"}},{"$f":"IF(AND(BP22=10,$BN$4>=1,$BN$4<=6),BP22&\"A\",0)","v":{"$error":"#N/A"}},null,null,{"$error":"#N/A"},{"$f":"IF(AND($BT$4<=10,$BT$4>8),10,0)","v":{"$error":"#N/A"}},{"$f":"IF(AND(BU22=10,$BS$4>=1,$BS$4<=6),BU22&\"A\",0)","v":{"$error":"#N/A"}},null,null,null,"A17A",{"$f":"Frame_Width-2","v":-2},{"$f":"Frame_Height-5.75","v":-5.75},{"$f":"MAX(CA22:CB22)","v":-2},86]
[null,24,66,"YW",null,null,null,null,"Type",null,"A209",{"$f":"A209CDIM","v":0.1875},{"$f":"A209CDIM-0.4375","v":-0.25},null,null,null,null,null,null,{"$f":"(Frame_Width-(A209DDIM+4.229))/2","v":-1.95825},{"$f":"Frame_Height-(2.177*2)","v":-4.3540000000000001},null,null,"70 Series Flush Fin",11.75,null,null,null,null,"Bottom Sash",{"$f":"IF(OR(ModelNo=\"A571\",ModelNo=\"A740\",ModelNo=\"A744\",ModelNo=\"A746\"),TRUNC(SUM(AE13:AE21)),0)","v":0},null,null,null,"Bottom Sash",{"$f":"IF(OR(ModelNo=\"A581\",ModelNo=\"A840\",ModelNo=\"A844\",ModelNo=\"A846\"),TRUNC(SUM(AJ13:AJ21)),0)","v":0},null,null,null,{"$error":"#N/A"},{"$error":"#N/A"},{"$f":"IF(AND(AO23=11,$AM$4>=5,$AM$4<=6.99),AO23&\"-\"&\"2\",0)","v":{"$error":"#N/A"}},null,null,{"$error":"#N/A"},{"$error":"#N/A"},{"$f":"IF(AND(AT23=11,$AR$4>=5,$AR$4<=6.99),AT23&\"-\"&\"2\",0)","v":{"$error":"#N/A"}},null,{"$f":"IF(AY23>\"\",8,\"\")","v":""},"Visible Light Transmittance",{"$f":"IF(OR(AND(EXT_2=1,Thickness_Select=2),AND(OR(EXT_2=2,EXT_2=3),Thickness_Select=1)),\"81%\",\"\")","v":""},{"$f":"IF(OR(AND(EXT_2=1,Thickness_Select=2),AND(OR(EXT_2=2,EXT_2=3),Thickness_Select=1)),\"71%\",\"\")","v":""},{"$f":"IF(OR(AND(EXT_2=1,Thickness_Select=2),AND(OR(EXT_2=2,EXT_2=3),Thickness_Select=1)),\"62%\",\"\")","v":""},{"$f":"IF(OR(AND(EXT_2=1,Thickness_Select=2),AND(OR(EXT_2=2,EXT_2=3),Thickness_Select=1)),\"71%\",\"\")","v":""},null,null,null,null,9.75,"to",11.749000000000001,7,null,null,null,null,{"$error":"#N/A"},{"$error":"#N/A"},{"$f":"IF(AND(BP23=10,$BN$4>=7,$BN$4<=10),BP23&\"B\",0)","v":{"$error":"#N/A"}},null,null,{"$error":"#N/A"},{"$error":"#N/A"},{"$f":"IF(AND(BU23=10,$BS$4>=7,$BS$4<=10),BU23&\"B\",0)","v":{"$error":"#N/A"}},null,null,null,"3A04",{"$f":"Frame_Width-4.1875","v":-4.1875},{"$f":"Frame_Height-4.1875","v":-4.1875},{"$f":"MAX(CA23:CB23)","v":-4.1875},88]
[null,25,67,"GN",null,null,null,1,{"$f":"IF(TYPE1>0,TYPE1,\"\")","v":""},null,"A270",null,null,null,null,null,null,null,null,null,null,null,null,"80 Series Flush Fin",11.75,null,null,null,null,null,null,null,null,null,null,null,null,null,null,{"$error":"#N/A"},{"$error":"#N/A"},{"$f":"IF(AND(AO24=11,$AM$4>=7,$AM$4<=8.99),AO24&\"-\"&\"3\",0)","v":{"$error":"#N/A"}},null,null,{"$error":"#N/A"},{"$error":"#N/A"},{"$f":"IF(AND(AT24=11,$AR$4>=7,$AR$4<=8.99),AT24&\"-\"&\"3\",0)","v":{"$error":"#N/A"}},"x",{"$f":"IF(AY24>\"\",9,\"\")","v":""},"Ultraviolet Light Transmittance",{"$f":"IF(OR(AND(EXT_2=1,Thickness_Select=2),AND(OR(EXT_2=2,EXT_2=3),Thickness_Select=1)),\"58%\",\"\")","v":""},{"$f":"IF(OR(AND(EXT_2=1,Thickness_Select=2),AND(OR(EXT_2=2,EXT_2=3),Thickness_Select=1)),\"16%\",\"\")","v":""},{"$f":"IF(OR(AND(EXT_2=1,Thickness_Select=2),AND(OR(EXT_2=2,EXT_2=3),Thickness_Select=1)),\"5%\",\"\")","v":""},{"$f":"IF(OR(AND(EXT_2=1,Thickness_Select=2),AND(OR(EXT_2=2,EXT_2=3),Thickness_Select=1)),\"16%\",\"\")","v":""},null,null,null,null,11.75,"to",13.749000000000001,9,null,null,null,null,{"$error":"#N/A"},{"$error":"#N/A"},{"$f":"IF(AND(BP24=10,$BN$4>=11,$BN$4<=13),BP24&\"C\",0)","v":{"$error":"#N/A"}},null,null,{"$error":"#N/A"},{"$error":"#N/A"},{"$f":"IF(AND(BU24=10,$BS$4>=11,$BS$4<=13),BU24&\"C\",0)","v":{"$error":"#N/A"}},null,null,null,"03S4",{"$f":"Frame_Width-4.1875","v":-4.1875},{"$f":"Frame_Height-4.1875","v":-4.1875},{"$f":"MAX(CA24:CB24)","v":-4.1875},88]
[null,26,67,"GN",null,null,null,2,{"$f":"IF(TYPE2>0,TYPE2,\"\")","v":""},null,"A272",{"$f":"A272CDIM","v":0},{"$f":"A272CDIM-0.875","v":-0.875},null,null,null,null,null,null,{"$f":"A272CDIM-2.875","v":-2.875},{"$f":"Frame_Height-3.3125","v":-3.3125},null,null,null,null,null,null,"A201","Length","Weight/ft","Weight",null,"A991","Length","Weight/ft","Weight",null,null,null,{"$error":"#N/A"},{"$error":"#N/A"},{"$f":"IF(AND(AO25=11,$AM$4>=9,$AM$4<=10.99),AO25&\"-\"&\"4\",0)","v":{"$error":"#N/A"}},null,null,{"$error":"#N/A"},{"$error":"#N/A"},{"$f":"IF(AND(AT25=11,$AR$4>=9,$AR$4<=10.99),AT25&\"-\"&\"4\",0)","v":{"$error":"#N/A"}},null,{"$f":"IF(AY25>\"\",10,\"\")","v":""},"Solar Heat Gain Coefficient",{"$f":"IF(OR(AND(EXT_2=1,Thickness_Select=2),AND(OR(EXT_2=2,EXT_2=3),Thickness_Select=1)),\"0.75\",\"\")","v":""},{"$f":"IF(OR(AND(EXT_2=1,Thickness_Select=2),AND(OR(EXT_2=2,EXT_2=3),Thickness_Select=1)),0.38,\"\")","v":""},{"$f":"IF(OR(AND(EXT_2=1,Thickness_Select=2),AND(OR(EXT_2=2,EXT_2=3),Thickness_Select=1)),0.36,\"\")","v":""},{"$f":"IF(OR(AND(EXT_2=1,Thickness_Select=2),AND(OR(EXT_2=2,EXT_2=3),Thickness_Select=1)),0.38,\"\")","v":""},null,null,null,null,13.75,"to",15.749000000000001,11,null,null,null,null,{"$error":"#N/A"},{"$error":"#N/A"},{"$f":"IF(AND(BP25=10,$BN$4>=14,$BN$4<=16),BP25&\"D\",0)","v":{"$error":"#N/A"}},null,null,{"$error":"#N/A"},{"$error":"#N/A"},{"$f":"IF(AND(BU25=10,$BS$4>=14,$BS$4<=16),BU25&\"D\",0)","v":{"$error":"#N/A"}},null,null,null,{"$f":"Model_Select","v":"Select Model"},null,null,{"$f":"VLOOKUP(Model_Select,BZ5:CC24,4,FALSE)","v":{"$error":"#N/A"}},{"$f":"VLOOKUP(Model_Select,BZ5:CD24,5,FALSE)","v":{"$error":"#N/A"}}]
[null,27,77,"LG",null,null,null,3,{"$f":"IF(TYPE3>0,TYPE3,\"\")","v":""},null,"A273",{"$f":"A273CDIM","v":-0.1875},{"$f":"A273CDIM-0.875","v":-1.0625},null,null,null,null,null,null,{"$f":"A273CDIM-2.875","v":-3.0625},{"$f":"Frame_Height-3.3125","v":-3.3125},null,null,null,null,null,null,"Top Top Rail",{"$f":"(Frame_Width-3.25)/12","v":-0.27083333333333331},0.25700000000000001,{"$f":"AC26*AD26","v":-6.9604166666666661E-2},null,"Top Top Rail",0,0,{"$f":"AH26*AI26","v":0},null,null,null,{"$error":"#N/A"},{"$error":"#N/A"},{"$f":"IF(AND(AO26=11,$AM$4>=11,$AM$4<=12.99),AO26&\"-\"&\"5\",0)","v":{"$error":"#N/A"}},null,null,{"$error":"#N/A"},{"$error":"#N/A"},{"$f":"IF(AND(AT26=11,$AR$4>=11,$AR$4<=12.99),AT26&\"-\"&\"5\",0)","v":{"$error":"#N/A"}},null,null,"1\"",null,null,null,null,null,null,null,null,15.75,"to",17.749000000000002,13,null,null,null,null,{"$error":"#N/A"},{"$error":"#N/A"},{"$f":"IF(AND(BP26=10,$BN$4>=17,$BN$4<=19),BP26&\"E\",0)","v":{"$error":"#N/A"}},null,null,{"$error":"#N/A"},{"$error":"#N/A"},{"$f":"IF(AND(BU26=10,$BS$4>=17,$BS$4<=19),BU26&\"E\",0)","v":{"$error":"#N/A"}},null,null,null,null,null,null,null,{"$f":"IF(CC25>CD25,1,0)","v":{"$error":"#N/A"}},{"$f":"IF(CD26=1,\"Max Short Glass Must be Less Than \"&MAX_SG,\"\")","v":{"$error":"#N/A"}}]
[null,28,77,"LG",null,null,null,4,{"$f":"IF(TYPE4>0,TYPE4,\"\")","v":""},null,"A280",null,null,null,null,null,null,null,null,null,null,null,null,null,null,null,null,"Top Bottom Rail",{"$f":"(Frame_Width-3.25)/12","v":-0.27083333333333331},0.27300000000000002,-7.3937500000000003E-2,null,"Top Bottom Rail",0,0,{"$f":"AH27*AI27","v":0},null,null,null,{"$error":"#N/A"},{"$error":"#N/A"},{"$f":"IF(AND(AO27=11,$AM$4>=13,$AM$4<=15.99),AO27&\"-\"&\"6\",0)","v":{"$error":"#N/A"}},null,null,{"$error":"#N/A"},{"$error":"#N/A"},{"$f":"IF(AND(AT27=11,$AR$4>=13,$AR$4<=15.99),AT27&\"-\"&\"6\",0)","v":{"$error":"#N/A"}},null,{"$f":"IF(AY27>\"\",1,\"\")","v":""},"Outside Pane",{"$f":"IF(AND(EXT_2=3,Thickness_Select=2),\"Clear\",IF(AND(EXT_2=5,Thickness_Select=1),\"Clear\",\"\"))","v":""},{"$f":"IF(AND(EXT_2=3,Thickness_Select=2),\"SB60\",IF(AND(EXT_2=5,Thickness_Select=1),\"SB60\",\"\"))","v":""},{"$f":"IF(AND(EXT_2=3,Thickness_Select=2),\"SB60\",IF(AND(EXT_2=5,Thickness_Select=1),\"SB60\",\"\"))","v":""},{"$f":"IF(AND(EXT_2=3,Thickness_Select=2),\"SB60\",IF(AND(EXT_2=5,Thickness_Select=1),\"SB60\",\"\"))","v":""},{"$f":"IF(AND(EXT_2=3,Thickness_Select=2),\"SB60\",IF(AND(EXT_2=5,Thickness_Select=1),\"SB60\",\"\"))","v":""},null,null,null,17.75,"to",19.749000000000002,15,null,null,null,null,{"$error":"#N/A"},{"$error":"#N/A"},{"$f":"IF(AND(BP27=10,$BN$4=20),\"Dbl.\"&BP27&\"B\",0)","v":{"$error":"#N/A"}},null,null,{"$error":"#N/A"},{"$error":"#N/A"},{"$f":"IF(AND(BU27=10,$BS$4=20),\"Dbl.\"&BU27&\"B\",0)","v":{"$error":"#N/A"}}]
[null,29,78,"OR",null,null,null,1,{"$f":"VLOOKUP(TYPE,H24:I27,2,FALSE)","v":""},null,"A282",{"$f":"A282CDIM","v":0},{"$f":"A282CDIM-1.5","v":-1.5},null,null,null,null,3.125,null,{"$f":"A282CDIM-3.25","v":-3.25},{"$f":"Frame_Height-3.3125","v":-3.3125},null,null,null,null,null,null,"Top Stile",{"$f":"(2*(A201DDIM-1.5625))/12","v":-0.26041666666666669},0.23300000000000001,-6.067708333333334E-2,null,"Top Stile",0,0,{"$f":"(AH28*AI28)/12","v":0},null,null,null,{"$error":"#N/A"},{"$error":"#N/A"},{"$f":"IF(AND(AO28=11,$AM$4>=16,$AM$4<=19.99),AO28&\"-\"&\"9\",0)","v":{"$error":"#N/A"}},null,null,{"$error":"#N/A"},{"$error":"#N/A"},{"$f":"IF(AND(AT28=11,$AR$4>=16,$AR$4<=19.99),AT28&\"-\"&\"9\",0)","v":{"$error":"#N/A"}},null,{"$f":"IF(AY28>\"\",2,\"\")","v":""},"Middle Pane",{"$f":"IF(AND(EXT_2=3,Thickness_Select=2),\"N/A\",IF(AND(EXT_2=5,Thickness_Select=1),\"N/A\",\"\"))","v":""},{"$f":"IF(AND(EXT_2=3,Thickness_Select=2),\"N/A\",IF(AND(EXT_2=5,Thickness_Select=1),\"N/A\",\"\"))","v":""},{"$f":"IF(AND(EXT_2=3,Thickness_Select=2),\"N/A\",IF(AND(EXT_2=5,Thickness_Select=1),\"N/A\",\"\"))","v":""},{"$f":"IF(AND(EXT_2=3,Thickness_Select=2),\"N/A\",IF(AND(EXT_2=5,Thickness_Select=1),\"Clear\",\"\"))","v":""},{"$f":"IF(AND(EXT_2=3,Thickness_Select=2),\"Clear\",IF(AND(EXT_2=5,Thickness_Select=1),\"Clear\",\"\"))","v":""},null,null,null,19.75,"to",21.749000000000002,17,null,null,null,null,{"$error":"#N/A"},{"$error":"#N/A"},{"$f":"IF(AND(BP28=10,$BN$4>=21,$BN$4<=26),\"Dbl.\"&BP28&\"C\",0)","v":{"$error":"#N/A"}},null,null,{"$error":"#N/A"},{"$error":"#N/A"},{"$f":"IF(AND(BU28=10,$BS$4>=21,$BS$4<=26),\"Dbl.\"&BU28&\"C\",0)","v":{"$error":"#N/A"}}]
[null,30,78,"OR",null,null,null,null,null,null,"A283",{"$f":"A283CDIM","v":-0.1875},{"$f":"A283CDIM-1.5","v":-1.6875},null,null,null,null,null,null,{"$f":"A283CDIM-3.25","v":-3.4375},{"$f":"Frame_Height-3.3125","v":-3.3125},null,null,null,null,null,null,"Top Rail Reinf.",{"$f":"(TRUNC(((Frame_Width-3.25)-6)/2)*2)/12","v":-0.66666666666666663},0.29899999999999999,-0.19933333333333331,null,"Top Rail Reinf.",0,0,0,null,null,null,{"$error":"#N/A"},{"$error":"#N/A"},{"$f":"IF(AND(AO29=11,$AM$4>=20,$AM$4<=23.99),AO29&\"-\"&\"11\",0)","v":{"$error":"#N/A"}},null,null,{"$error":"#N/A"},{"$error":"#N/A"},{"$f":"IF(AND(AT29=11,$AR$4>=20,$AR$4<=23.99),AT29&\"-\"&\"11\",0)","v":{"$error":"#N/A"}},null,{"$f":"IF(AY29>\"\",3,\"\")","v":""},"Inside Pane",{"$f":"IF(AND(EXT_2=3,Thickness_Select=2),\"Clear\",IF(AND(EXT_2=5,Thickness_Select=1),\"Clear\",\"\"))","v":""},{"$f":"IF(AND(EXT_2=3,Thickness_Select=2),\"Clear\",IF(AND(EXT_2=5,Thickness_Select=1),\"Clear\",\"\"))","v":""},{"$f":"IF(AND(EXT_2=3,Thickness_Select=2),\"SB60\",IF(AND(EXT_2=5,Thickness_Select=1),\"SB60\",\"\"))","v":""},{"$f":"IF(AND(EXT_2=3,Thickness_Select=2),\"Clear\",IF(AND(EXT_2=5,Thickness_Select=1),\"SB60\",\"\"))","v":""},{"$f":"IF(AND(EXT_2=3,Thickness_Select=2),\"SB60\",IF(AND(EXT_2=5,Thickness_Select=1),\"SB60\",\"\"))","v":""},null,null,null,21.75,"to",23.749000000000002,19,null,null,null,null,{"$error":"#N/A"},{"$error":"#N/A"},{"$f":"IF(AND(BP29=10,$BN$4>=27,$BN$4<=32),\"Dbl.\"&BP29&\"D\",0)","v":{"$error":"#N/A"}},null,null,{"$error":"#N/A"},{"$error":"#N/A"},{"$f":"IF(AND(BU29=10,$BS$4>=27,$BS$4<=32),\"Dbl.\"&BU29&\"D\",0)","v":{"$error":"#N/A"}}]
[null,31,88,"WT",null,null,null,null,"Opening",null,"A390",null,null,null,null,null,null,null,null,null,null,null,null,null,null,null,null,"Top Stile Reinf",{"$f":"IF(CMR!$E$15>26.6875,((TRUNC((A201DDIM-9.5)/2)*2)/12)*2,0)","v":0},0.29899999999999999,0,null,"Top Stile Reinf",0,0,0,null,null,null,{"$f":"IF(AND(AO30>0,AP30>0),AO30,0)","v":{"$error":"#N/A"}},{"$error":"#N/A"},{"$f":"IF(AND(AO30=11,$AM$4>=24,$AM$4<=27),AO30&\"-\"&\"12\",0)","v":{"$error":"#N/A"}},null,null,{"$error":"#N/A"},{"$error":"#N/A"},{"$f":"IF(AND(AT30=11,$AR$4>=24,$AR$4<=27),AT30&\"-\"&\"12\",0)","v":{"$error":"#N/A"}},null,{"$f":"IF(AY30>\"\",4,\"\")","v":""},"Spacer",{"$f":"IF(AND(EXT_2=3,Thickness_Select=2),\"Intercept\",IF(AND(EXT_2=5,Thickness_Select=1),\"Intercept\",\"\"))","v":""},{"$f":"IF(AND(EXT_2=3,Thickness_Select=2),\"Intercept\",IF(AND(EXT_2=5,Thickness_Select=1),\"Intercept\",\"\"))","v":""},{"$f":"IF(AND(EXT_2=3,Thickness_Select=2),\"Intercept\",IF(AND(EXT_2=5,Thickness_Select=1),\"SST\",\"\"))","v":""},{"$f":"IF(AND(EXT_2=3,Thickness_Select=2),\"SST\",IF(AND(EXT_2=5,Thickness_Select=1),\"SST\",\"\"))","v":""},{"$f":"IF(AND(EXT_2=3,Thickness_Select=2),\"Intercept\",IF(AND(EXT_2=5,Thickness_Select=1),\"SST\",\"\"))","v":""},null,null,null,23.75,"to",25.749000000000002,21,null,null,null,null,{"$error":"#N/A"},{"$error":"#N/A"},{"$f":"IF(AND(BP30=10,$BN$4>=33,$BN$4<=38),\"Dbl.\"&BP30&\"E\",0)","v":{"$error":"#N/A"}},null,null,{"$error":"#N/A"},{"$error":"#N/A"},{"$f":"IF(AND(BU30=10,$BS$4>=33,$BS$4<=38),\"Dbl.\"&BU30&\"E\",0)","v":{"$error":"#N/A"}}]
[null,32,88,"WT",null,null,null,1,"Exact Size",null,"A392",{"$f":"A392CDIM","v":0},{"$f":"A392CDIM-1.5","v":-1.5},null,null,null,null,null,null,{"$f":"A392CDIM-3.25","v":-3.25},{"$f":"Frame_Height-3.3125","v":-3.3125},null,null,null,null,null,null,"Top Glass",{"$f":"(CMR!$E$13*CMR!$E$15)/144","v":0.10791015625},{"$f":"$H$10","v":2.3140000000000001},0.2497041015625,null,"Top Glass",0,0,0,null,null,null,{"$error":"#N/A"},{"$f":"IF(AND($AN$4<=13,$AN$4>11),13,0)","v":{"$error":"#N/A"}},{"$f":"IF(AND(AO31=13,$AM$4>=3,$AM$4<=4.99),AO31&\"-\"&\"1\",0)","v":{"$error":"#N/A"}},null,null,{"$error":"#N/A"},{"$f":"IF(AND($AS$4<=13,$AS$4>11),13,0)","v":{"$error":"#N/A"}},{"$f":"IF(AND(AT31=13,$AR$4>=3,$AR$4<=4.99),AT31&\"-\"&\"1\",0)","v":{"$error":"#N/A"}},null,{"$f":"IF(AY31>\"\",5,\"\")","v":""},"Gas",{"$f":"IF(AND(EXT_2=3,Thickness_Select=2),\"Air\",IF(AND(EXT_2=5,Thickness_Select=1),\"Air\",\"\"))","v":""},{"$f":"IF(AND(EXT_2=3,Thickness_Select=2),\"Argon\",IF(AND(EXT_2=5,Thickness_Select=1),\"Argon\",\"\"))","v":""},{"$f":"IF(AND(EXT_2=3,Thickness_Select=2),\"Argon\",IF(AND(EXT_2=5,Thickness_Select=1),\"Argon\",\"\"))","v":""},{"$f":"IF(AND(EXT_2=3,Thickness_Select=2),\"Argon\",IF(AND(EXT_2=5,Thickness_Select=1),\"Argon\",\"\"))","v":""},{"$f":"IF(AND(EXT_2=3,Thickness_Select=2),\"Argon\",IF(AND(EXT_2=5,Thickness_Select=1),\"Krypton\",\"\"))","v":""},null,null,null,25.75,"to",27.749000000000002,23,null,null,null,null,{"$error":"#N/A"},{"$f":"IF(AND($BO$4<=12,$BO$4>10),12,0)","v":{"$error":"#N/A"}},{"$f":"IF(AND(BP31=12,$BN$4>=3,$BN$4<=7),BP31&\"A\",0)","v":{"$error":"#N/A"}},null,null,{"$error":"#N/A"},{"$f":"IF(AND($BT$4<=12,$BT$4>10),12,0)","v":{"$error":"#N/A"}},{"$f":"IF(AND(BU31=12,$BS$4>=3,$BS$4<=7),BU31&\"A\",0)","v":{"$error":"#N/A"}}]
[null,33,89,"NAT",null,null,null,2,"Rough Opening",null,"A393",{"$f":"A393CDIM","v":-0.1875},{"$f":"A393CDIM-1.5","v":-1.6875},null,null,null,null,null,null,{"$f":"A393CDIM-3.25","v":-3.4375},{"$f":"Frame_Height-3.3125","v":-3.3125},null,null,null,null,null,null,"Top Spacer",{"$f":"((CMR!$E$13*2)+(CMR!$E$15*2))/12","v":-1.34375},5.3600000000000002E-2,-7.2025000000000006E-2,null,"Top Spacer",0,0,0,null,null,null,{"$error":"#N/A"},{"$error":"#N/A"},{"$f":"IF(AND(AO32=13,$AM$4>=5,$AM$4<=7.99),AO32&\"-\"&\"2\",0)","v":{"$error":"#N/A"}},null,null,{"$error":"#N/A"},{"$error":"#N/A"},{"$f":"IF(AND(AT32=13,$AR$4>=5,$AR$4<=7.99),AT32&\"-\"&\"2\",0)","v":{"$error":"#N/A"}},null,{"$f":"IF(AY32>\"\",6,\"\")","v":""},"R-Value",{"$f":"IF(AND(EXT_2=3,Thickness_Select=2),\"2.0\",IF(AND(EXT_2=5,Thickness_Select=1),\"2.0\",\"\"))","v":""},{"$f":"IF(AND(EXT_2=3,Thickness_Select=2),\"3.85\",IF(AND(EXT_2=5,Thickness_Select=1),\"3.85\",\"\"))","v":""},{"$f":"IF(AND(EXT_2=3,Thickness_Select=2),\"4.0\",IF(AND(EXT_2=5,Thickness_Select=1),\"4.0\",\"\"))","v":""},{"$f":"IF(AND(EXT_2=3,Thickness_Select=2),\"3.85\",IF(AND(EXT_2=5,Thickness_Select=1),\"6.67\",\"\"))","v":""},{"$f":"IF(AND(EXT_2=3,Thickness_Select=2),\"6.67\",IF(AND(EXT_2=5,Thickness_Select=1),\"10.0\",\"\"))","v":""},null,null,null,27.75,"to",29.749000000000002,25,null,null,null,null,{"$error":"#N/A"},{"$error":"#N/A"},{"$f":"IF(AND(BP32=12,$BN$4>=8,$BN$4<=10),BP32&\"B\",0)","v":{"$error":"#N/A"}},null,null,{"$error":"#N/A"},{"$error":"#N/A"},{"$f":"IF(AND(BU32=12,$BS$4>=8,$BS$4<=10),BU32&\"B\",0)","v":{"$error":"#N/A"}}]
[null,34,89,"NAT",null,null,null,2,{"$f":"VLOOKUP(RO,H31:I32,2,FALSE)","v":"Rough Opening"},null,"A501",{"$f":"A501CDIM","v":0},{"$f":"TRUNC((A501CDIM-0.6875)*32+0.5)/32","v":-0.65625},{"$f":"TRUNC((A501DDIM-1.6875)*32+0.5)/32","v":-1.65625},{"$f":"AE69","v":0},{"$f":"AE68","v":0},null,null,null,{"$f":"Frame_Width-5.9375","v":-5.9375},{"$f":"IF(TRUNC((Frame_Height-M33-R33)*16+0.5)/16<(TRUNC((L33-$Y$5-S33)*16+0.5)/16),TRUNC((Frame_Height-M33-R33)*16+0.5)/16,TRUNC((L33-$Y$5-S33)*16+0.5)/16)","v":{"$error":"#N/A"}},null,{"$f":"TRUNC((A501DDIM-1.6875)*32+0.5)/32","v":-1.65625},"<< Top Sash Height",null,null,null,"Top Hardware",1,0.2,0.2,null,"Top Hardware",0,0,0,null,null,null,{"$error":"#N/A"},{"$error":"#N/A"},{"$f":"IF(AND(AO33=13,$AM$4>=8,$AM$4<=9.99),AO33&\"-\"&\"3\",0)","v":{"$error":"#N/A"}},null,null,{"$error":"#N/A"},{"$error":"#N/A"},{"$f":"IF(AND(AT33=13,$AR$4>=8,$AR$4<=9.99),AT33&\"-\"&\"3\",0)","v":{"$error":"#N/A"}},null,{"$f":"IF(AY33>\"\",7,\"\")","v":""},"U-Value",{"$f":"IF(AND(EXT_2=3,Thickness_Select=2),\"0.50\",IF(AND(EXT_2=5,Thickness_Select=1),\"0.50\",\"\"))","v":""},{"$f":"IF(AND(EXT_2=3,Thickness_Select=2),\"0.26\",IF(AND(EXT_2=5,Thickness_Select=1),\"0.26\",\"\"))","v":""},{"$f":"IF(AND(EXT_2=3,Thickness_Select=2),\"0.25\",IF(AND(EXT_2=5,Thickness_Select=1),\"0.25\",\"\"))","v":""},{"$f":"IF(AND(EXT_2=3,Thickness_Select=2),\"0.26\",IF(AND(EXT_2=5,Thickness_Select=1),\"0.15\",\"\"))","v":""},{"$f":"IF(AND(EXT_2=3,Thickness_Select=2),\"0.15\",IF(AND(EXT_2=5,Thickness_Select=1),\"0.10\",\"\"))","v":""},null,null,null,29.75,"to",31.749000000000002,27,null,null,null,null,{"$error":"#N/A"},{"$error":"#N/A"},{"$f":"IF(AND(BP33=12,$BN$4>=11,$BN$4<=16),BP33&\"C\",0)","v":{"$error":"#N/A"}},null,null,{"$error":"#N/A"},{"$error":"#N/A"},{"$f":"IF(AND(BU33=12,$BS$4>=11,$BS$4<=16),BU33&\"C\",0)","v":{"$error":"#N/A"}}]
[null,35,99,"PU",null,null,null,null,null,null,"A570",null,null,null,null,null,null,null,null,null,null,null,null,null,null,null,null,"Top Bead",{"$f":"(((Frame_Width-4.3125)*2)+((A201DDIM-2.625)*2))/12","v":-1.15625},2.8000000000000001E-2,-3.2375000000000001E-2,null,"Top Bead",0,0,0,null,null,null,{"$error":"#N/A"},{"$error":"#N/A"},{"$f":"IF(AND(AO34=13,$AM$4>=10,$AM$4<=12.99),AO34&\"-\"&\"4\",0)","v":{"$error":"#N/A"}},null,null,{"$error":"#N/A"},{"$error":"#N/A"},{"$f":"IF(AND(AT34=13,$AR$4>=10,$AR$4<=12.99),AT34&\"-\"&\"4\",0)","v":{"$error":"#N/A"}},null,{"$f":"IF(AY34>\"\",8,\"\")","v":""},"Visible Light Transmittance",{"$f":"IF(AND(EXT_2=3,Thickness_Select=2),\"82%\",IF(AND(EXT_2=5,Thickness_Select=1),\"82%\",\"\"))","v":""},{"$f":"IF(AND(EXT_2=3,Thickness_Select=2),\"72%\",IF(AND(EXT_2=5,Thickness_Select=1),\"72%\",\"\"))","v":""},{"$f":"IF(AND(EXT_2=3,Thickness_Select=2),\"62%\",IF(AND(EXT_2=5,Thickness_Select=1),\"62%\",\"\"))","v":""},{"$f":"IF(AND(EXT_2=3,Thickness_Select=2),\"72%\",IF(AND(EXT_2=5,Thickness_Select=1),\"57%\",\"\"))","v":""},{"$f":"IF(AND(EXT_2=3,Thickness_Select=2),\"57%\",IF(AND(EXT_2=5,Thickness_Select=1),\"57%\",\"\"))","v":""},null,null,null,31.75,"to",33.749000000000002,29,null,null,null,null,{"$error":"#N/A"},{"$error":"#N/A"},{"$f":"IF(AND(BP34=12,$BN$4>=17,$BN$4<=18),BP34&\"D\",0)","v":{"$error":"#N/A"}},null,null,{"$error":"#N/A"},{"$error":"#N/A"},{"$f":"IF(AND(BU34=12,$BS$4>=17,$BS$4<=18),BU34&\"D\",0)","v":{"$error":"#N/A"}}]
[null,36,99,"PU",null,null,null,{"$f":"IF(OR(ModelNo=\"0100\",ModelNo=\"01HP\",ModelNo=\"0102\",ModelNo=\"0103\",ModelNo=\"0104\",ModelNo=\"0109\",ModelNo=\"0151\",ModelNo=\"0152\",ModelNo=\"0153\",ModelNo=\"0154\",ModelNo=\"0155\",ModelNo=\"0170\",ModelNo=\"0171\",ModelNo=\"0172\",ModelNo=\"0173\",ModelNo=\"S174\",ModelNo=\"S175\",ModelNo=\"0179\",ModelNo=\"0301\"),1,0)","v":0},"Screen",null,"A571",{"$f":"A571CDIM","v":0},{"$f":"A571CDIM-0.875","v":-0.875},null,{"$f":"AE23","v":0},null,null,null,null,{"$f":"Frame_Width-(1.625*2)","v":-3.25},{"$f":"A571CDIM-3.75","v":-3.75},null,null,null,null,null,null,"Bottom Top Rail",{"$f":"(Frame_Width-2.25)/12","v":-0.1875},0.246,{"$f":"AC35*AD35","v":-4.6124999999999999E-2},null,"Bottom Top Rail",{"$f":"(Frame_Width-2.125)/12","v":-0.17708333333333334},0.35499999999999998,{"$f":"AH35*AI35","v":-6.2864583333333335E-2},null,null,null,{"$error":"#N/A"},{"$error":"#N/A"},{"$f":"IF(AND(AO35=13,$AM$4>=13,$AM$4<=15.99),AO35&\"-\"&\"5\",0)","v":{"$error":"#N/A"}},null,null,{"$error":"#N/A"},{"$error":"#N/A"},{"$f":"IF(AND(AT35=13,$AR$4>=13,$AR$4<=15.99),AT35&\"-\"&\"5\",0)","v":{"$error":"#N/A"}},"x",{"$f":"IF(AY35>\"\",9,\"\")","v":""},"Ultraviolet Light Transmittance",{"$f":"IF(AND(EXT_2=3,Thickness_Select=2),\"63%\",IF(AND(EXT_2=5,Thickness_Select=1),\"63%\",\"\"))","v":""},{"$f":"IF(AND(EXT_2=3,Thickness_Select=2),\"16%\",IF(AND(EXT_2=5,Thickness_Select=1),\"16%\",\"\"))","v":""},{"$f":"IF(AND(EXT_2=3,Thickness_Select=2),\"5%\",IF(AND(EXT_2=5,Thickness_Select=1),\"5%\",\"\"))","v":""},{"$f":"IF(AND(EXT_2=3,Thickness_Select=2),\"16%\",IF(AND(EXT_2=5,Thickness_Select=1),\"5%\",\"\"))","v":""},{"$f":"IF(AND(EXT_2=3,Thickness_Select=2),\"5%\",IF(AND(EXT_2=5,Thickness_Select=1),\"5%\",\"\"))","v":""},null,null,null,33.75,"to",35.749000000000002,31,null,null,null,null,{"$error":"#N/A"},{"$error":"#N/A"},{"$f":"IF(AND(BP35=12,$BN$4>=19,$BN$4<=21),BP35&\"E\",0)","v":{"$error":"#N/A"}},null,null,{"$error":"#N/A"},{"$error":"#N/A"},{"$f":"IF(AND(BU35=12,$BS$4>=19,$BS$4<=21),BU35&\"E\",0)","v":{"$error":"#N/A"}}]
[null,37,766,"BU",null,null,null,1,{"$f":"IF(SCREEN1>\"\",SCREEN1,\"\")","v":""},null,"A580",null,null,null,null,null,null,null,null,null,null,null,null,null,null,null,null,"Bottom Bottom Rail",{"$f":"(Frame_Width-2.25)/12","v":-0.1875},0.25700000000000001,-4.8187500000000001E-2,null,"Bottom Bottom Rail",{"$f":"(Frame_Width-2.8125)/12","v":-0.234375},0.35499999999999998,-8.3203124999999989E-2,null,null,null,{"$error":"#N/A"},{"$error":"#N/A"},{"$f":"IF(AND(AO36=13,$AM$4>=16,$AM$4<=18.99),AO36&\"-\"&\"6\",0)","v":{"$error":"#N/A"}},null,null,{"$error":"#N/A"},{"$error":"#N/A"},{"$f":"IF(AND(AT36=13,$AR$4>=16,$AR$4<=18.99),AT36&\"-\"&\"6\",0)","v":{"$error":"#N/A"}},null,{"$f":"IF(AY36>\"\",10,\"\")","v":""},"Solar Heat Gain Coefficient",{"$f":"IF(AND(EXT_2=3,Thickness_Select=2),\"0.78\",IF(AND(EXT_2=5,Thickness_Select=1),\"0.78\",\"\"))","v":""},{"$f":"IF(AND(EXT_2=3,Thickness_Select=2),\"0.39\",IF(AND(EXT_2=5,Thickness_Select=1),\"0.39\",\"\"))","v":""},{"$f":"IF(AND(EXT_2=3,Thickness_Select=2),\"0.36\",IF(AND(EXT_2=5,Thickness_Select=1),\"0.36\",\"\"))","v":""},{"$f":"IF(AND(EXT_2=3,Thickness_Select=2),\"0.39\",IF(AND(EXT_2=5,Thickness_Select=1),\"0.33\",\"\"))","v":""},{"$f":"IF(AND(EXT_2=3,Thickness_Select=2),\"0.33\",IF(AND(EXT_2=5,Thickness_Select=1),\"0.33\",\"\"))","v":""},null,null,null,35.75,"to",37.749000000000002,33,null,null,null,null,{"$error":"#N/A"},{"$error":"#N/A"},{"$f":"IF(AND(BP36=12,$BN$4>=22,$BN$4<=32),\"Dbl.\"&BP36&\"C\",0)","v":{"$error":"#N/A"}},null,null,{"$error":"#N/A"},{"$error":"#N/A"},{"$f":"IF(AND(BU36=12,$BS$4>=22,$BS$4<=32),\"Dbl.\"&BU36&\"C\",0)","v":{"$error":"#N/A"}}]
[null,38,766,"BU",null,null,null,2,{"$f":"IF(SCREEN2>\"\",SCREEN2,\"\")","v":""},null,"A581",{"$f":"A581CDIM","v":0},{"$f":"A581CDIM-1.5","v":-1.5},null,{"$f":"AJ23","v":0},{"$f":"AJ22","v":0},null,null,null,{"$f":"Frame_Width-(1.75*2)","v":-3.5},{"$f":"A581CDIM-3.5","v":-3.5},null,null,null,null,null,null,"Bottom Stile",{"$f":"(2*(A201CDIM-0.5625))/12","v":-9.375E-2},0.23300000000000001,-2.1843750000000002E-2,null,"Bottom Stile",{"$f":"((A991CDIM-1.5)*2)/12","v":-0.25},0.36099999999999999,-9.0249999999999997E-2,null,null,null,{"$error":"#N/A"},{"$error":"#N/A"},{"$f":"IF(AND(AO37=13,$AM$4>=19,$AM$4<=21.99),AO37&\"-\"&\"9\",0)","v":{"$error":"#N/A"}},null,null,{"$error":"#N/A"},{"$error":"#N/A"},{"$f":"IF(AND(AT37=13,$AR$4>=19,$AR$4<=21.99),AT37&\"-\"&\"9\",0)","v":{"$error":"#N/A"}},null,null,0.875,null,null,null,null,null,null,null,null,37.75,"to",39.749000000000002,35,null,null,null,null,{"$error":"#N/A"},{"$error":"#N/A"},{"$f":"IF(AND(BP37=12,$BN$4>=33,$BN$4<=36),\"Dbl.\"&BP37&\"D\",0)","v":{"$error":"#N/A"}},null,null,{"$error":"#N/A"},{"$error":"#N/A"},{"$f":"IF(AND(BU37=12,$BS$4>=33,$BS$4<=36),\"Dbl.\"&BU37&\"D\",0)","v":{"$error":"#N/A"}}]
[null,39,866,"YW",null,null,null,3,{"$f":"IF(SCREEN3>\"\",SCREEN3,\"\")","v":""},null,"A680",null,null,null,null,null,null,null,null,null,null,null,null,null,null,null,null,"Bottom Rail Reinf.",{"$f":"(TRUNC(((Frame_Width-2.25)-6)/2)*2)/12","v":-0.66666666666666663},0.37,-0.24666666666666665,null,"Bottom Rail Reinf.",{"$f":"((AH35*12)-2.6875)/12","v":-0.40104166666666669},0.13800000000000001,-5.5343750000000004E-2,null,null,null,{"$error":"#N/A"},{"$error":"#N/A"},{"$f":"IF(AND(AO38=13,$AM$4>=22,$AM$4<=23.99),AO38&\"-\"&\"11\",0)","v":{"$error":"#N/A"}},null,null,{"$error":"#N/A"},{"$error":"#N/A"},{"$f":"IF(AND(AT38=13,$AR$4>=22,$AR$4<=23.99),AT38&\"-\"&\"11\",0)","v":{"$error":"#N/A"}},null,{"$f":"IF(AY38>\"\",1,\"\")","v":""},"Outside Pane",{"$f":"IF(EXT_2=4,\"Clear\",\"\")","v":""},{"$f":"IF(EXT_2=4,\"SB60\",\"\")","v":""},{"$f":"IF(EXT_2=4,\"SB60\",\"\")","v":""},{"$f":"IF(EXT_2=4,\"SB60\",\"\")","v":""},null,null,null,null,39.75,"to",41.749000000000002,37,null,null,null,null,{"$error":"#N/A"},{"$error":"#N/A"},{"$f":"IF(AND(BP38=12,$BN$4>=37,$BN$4<=42),\"Dbl.\"&BP38&\"E\",0)","v":{"$error":"#N/A"}},null,null,{"$error":"#N/A"},{"$error":"#N/A"},{"$f":"IF(AND(BU38=12,$BS$4>=37,$BS$4<=42),\"Dbl.\"&BU38&\"E\",0)","v":{"$error":"#N/A"}}]
[null,40,866,"YW",null,null,null,1,{"$f":"IF(Screen_Type=3,\"L\",IF(Screen_Type=2,\"F\",\"H\"))","v":"H"},null,"A681",null,null,null,null,null,null,null,null,null,null,null,null,null,null,null,null,"Bottom Stile Reinf.",{"$f":"IF(CMR!$E$16>27.6875,((TRUNC((A201CDIM-4.5)/2)*2)/12)*2,0)","v":0},0.29899999999999999,0,null,"Bottom Stile Reinf.",null,null,0,null,null,null,{"$f":"IF(AND(AO39>0,AP39>0),AO39,0)","v":{"$error":"#N/A"}},{"$error":"#N/A"},{"$f":"IF(AND(AO39=13,$AM$4>=24,$AM$4<=26.99),AO39&\"-\"&\"12\",0)","v":{"$error":"#N/A"}},null,null,{"$error":"#N/A"},{"$error":"#N/A"},{"$f":"IF(AND(AT39=13,$AR$4>=24,$AR$4<=26.99),AT39&\"-\"&\"12\",0)","v":{"$error":"#N/A"}},null,{"$f":"IF(AY39>\"\",2,\"\")","v":""},"Middle Pane",{"$f":"IF(EXT_2=4,\"N/A\",\"\")","v":""},{"$f":"IF(EXT_2=4,\"N/A\",\"\")","v":""},{"$f":"IF(EXT_2=4,\"N/A\",\"\")","v":""},{"$f":"IF(EXT_2=4,\"N/A\",\"\")","v":""},null,null,null,null,41.75,"to",43.749000000000002,39,null,null,null,null,{"$error":"#N/A"},{"$f":"IF(AND($BO$4<=14,$BO$4>12),14,0)","v":{"$error":"#N/A"}},{"$f":"IF(AND(BP39=14,$BN$4>=3,$BN$4<=7),BP39&\"A\",0)","v":{"$error":"#N/A"}},null,null,{"$error":"#N/A"},{"$f":"IF(AND($BT$4<=14,$BT$4>12),14,0)","v":{"$error":"#N/A"}},{"$f":"IF(AND(BU39=14,$BS$4>=3,$BS$4<=7),BU39&\"A\",0)","v":{"$error":"#N/A"}}]
[null,41,777,"GN",null,null,null,null,"3HP & 3WP add-on",null,"A682",null,null,null,null,null,null,null,null,{"$f":"Frame_Width-11.4375","v":-11.4375},{"$f":"Frame_Height-5.125","v":-5.125},null,null,null,null,null,null,"Bottom Glass",{"$f":"(CMR!$E$14*CMR!$E$16)/144","v":5.8865017361111112E-2},{"$f":"$H$10","v":2.3140000000000001},0.13621365017361112,null,"Bottom Glass",{"$f":"((A991CDIM-4)*(Frame_Width-5.3125))/144","v":0.14756944444444445},{"$f":"$H$10","v":2.3140000000000001},0.34147569444444448,null,null,null,{"$f":"IF(AND(AO40>0,AP40>0),AO40,0)","v":{"$error":"#N/A"}},{"$error":"#N/A"},{"$f":"IF(AND(AO40=13,$AM$4>=27,$AM$4<=29.99),AO40&\"-\"&\"13\",0)","v":{"$error":"#N/A"}},null,null,{"$error":"#N/A"},{"$error":"#N/A"},{"$f":"IF(AND(AT40=13,$AR$4>=27,$AR$4<=29.99),AT40&\"-\"&\"13\",0)","v":{"$error":"#N/A"}},null,{"$f":"IF(AY40>\"\",3,\"\")","v":""},"Inside Pane",{"$f":"IF(EXT_2=4,\"Clear\",\"\")","v":""},{"$f":"IF(EXT_2=4,\"Clear\",\"\")","v":""},{"$f":"IF(EXT_2=4,\"SB60\",\"\")","v":""},{"$f":"IF(EXT_2=4,\"Clear\",\"\")","v":""},null,null,null,null,43.75,"to",45.749000000000002,41,null,null,null,null,{"$error":"#N/A"},{"$error":"#N/A"},{"$f":"IF(AND(BP40=14,$BN$4>=8,$BN$4<=10),BP40&\"B\",0)","v":{"$error":"#N/A"}},null,null,{"$error":"#N/A"},{"$error":"#N/A"},{"$f":"IF(AND(BU40=14,$BS$4>=8,$BS$4<=10),BU40&\"B\",0)","v":{"$error":"#N/A"}}]
[null,42,777,"GN",null,null,null,null,{"$f":"IF(AND(OR(ModelNo=\"73HP\",ModelNo=\"73WP\"),EXTSELECT=2),0.3125,IF(AND(OR(ModelNo=\"73HP\",ModelNo=\"73WP\"),EXTSELECT=3),0.4375,IF(AND(OR(ModelNo=\"83HP\",ModelNo=\"83WP\"),EXTSELECT=2),0.4375,IF(AND(OR(ModelNo=\"83HP\",ModelNo=\"83WP\"),EXTSELECT=3),0.5625,0))))","v":0},null,"6COP",null,null,null,null,null,null,null,null,{"$f":"Frame_Width-11.4375","v":-11.4375},{"$f":"Frame_Height-_DIM3-5.125","v":-5.125},null,null,null,null,null,null,"Bottom Spacer",{"$f":"((CMR!$E$14*2)+(CMR!$E$16*2))/12","v":-1.0104166666666667},5.3600000000000002E-2,-5.4158333333333336E-2,null,"Bottom Spacer",{"$f":"(((A991CDIM-4)*2)+((Frame_Width-5.3125)*2))/12","v":-1.5520833333333333},5.3600000000000002E-2,{"$f":"AH41*AI41","v":-8.3191666666666664E-2},null,null,null,{"$f":"IF(AND(AO41>0,AP41>0),AO41,0)","v":{"$error":"#N/A"}},{"$error":"#N/A"},{"$f":"IF(AND(AO41=13,$AM$4>=30,$AM$4<=32.99),AO41&\"-\"&\"14\",0)","v":{"$error":"#N/A"}},null,null,{"$error":"#N/A"},{"$error":"#N/A"},{"$f":"IF(AND(AT41=13,$AR$4>=30,$AR$4<=32.99),AT41&\"-\"&\"14\",0)","v":{"$error":"#N/A"}},null,{"$f":"IF(AY41>\"\",4,\"\")","v":""},"Spacer",{"$f":"IF(EXT_2=4,\"Intercept\",\"\")","v":""},{"$f":"IF(EXT_2=4,\"Intercept\",\"\")","v":""},{"$f":"IF(EXT_2=4,\"Intercept\",\"\")","v":""},{"$f":"IF(EXT_2=4,\"SST\",\"\")","v":""},null,null,null,null,45.75,"to",47.749000000000002,43,null,null,null,null,{"$error":"#N/A"},{"$error":"#N/A"},{"$f":"IF(AND(BP41=14,$BN$4>=11,$BN$4<=16),BP41&\"C\",0)","v":{"$error":"#N/A"}},null,null,{"$error":"#N/A"},{"$error":"#N/A"},{"$f":"IF(AND(BU41=14,$BS$4>=11,$BS$4<=16),BU41&\"C\",0)","v":{"$error":"#N/A"}}]
[null,43,877,"LG",null,null,null,null,null,null,"62WC",null,null,null,null,null,null,null,null,{"$f":"IF(_DIM4=(W/2),_DIM4-11.4375,IF(_DIM4>(W/2),_DIM4-11.4375,IF(_DIM4<(W/2),Frame_Width-_DIM4-11.4375,0)))","v":-11.4375},{"$f":"Frame_Height-5.125","v":-5.125},null,null,null,null,null,null,"Bottom Hardware",1,0.36,0.36,null,"Bottom Hardware",1,0.36,{"$f":"AH42*AI42","v":0.36},null,null,null,{"$f":"IF(AND(AO42>0,AP42>0),AO42,0)","v":{"$error":"#N/A"}},{"$error":"#N/A"},{"$f":"IF(AND(AO42=13,$AM$4>=33,$AM$4<=35),AO42&\"-\"&\"15\",0)","v":{"$error":"#N/A"}},null,null,{"$error":"#N/A"},{"$error":"#N/A"},{"$f":"IF(AND(AT42=13,$AR$4>=33,$AR$4<=35),AT42&\"-\"&\"15\",0)","v":{"$error":"#N/A"}},null,{"$f":"IF(AY42>\"\",5,\"\")","v":""},"Gas",{"$f":"IF(EXT_2=4,\"Air\",\"\")","v":""},{"$f":"IF(EXT_2=4,\"Argon\",\"\")","v":""},{"$f":"IF(EXT_2=4,\"Argon\",\"\")","v":""},{"$f":"IF(EXT_2=4,\"Argon\",\"\")","v":""},null,null,null,null,47.75,"to",49.749000000000002,45,null,null,null,null,{"$error":"#N/A"},{"$error":"#N/A"},{"$f":"IF(AND(BP42=14,$BN$4>=17,$BN$4<=19),BP42&\"D\",0)","v":{"$error":"#N/A"}},null,null,{"$error":"#N/A"},{"$error":"#N/A"},{"$f":"IF(AND(BU42=14,$BS$4>=17,$BS$4<=19),BU42&\"D\",0)","v":{"$error":"#N/A"}}]
[null,44,877,"LG",null,null,null,null,null,null,"62CP",null,null,null,null,null,null,null,null,{"$f":"IF(_DIM4=(W/2),_DIM4-11.4375,IF(_DIM4>(W/2),_DIM4-11.4375,IF(_DIM4<(W/2),Frame_Width-_DIM4-11.4375,0)))","v":-11.4375},{"$f":"Frame_Height-_DIM3-5.125","v":-5.125},null,null,null,null,null,null,"Bottom Bead",{"$f":"(((Frame_Width-3.3125)*2)+((A201CDIM-1.625)*2))/12","v":-0.82291666666666663},2.8000000000000001E-2,-2.3041666666666665E-2,null,"Bottom Bead",{"$f":"(((Frame_Width-5.0625)*2)+((A991CDIM-3.75)*2))/12","v":-1.46875},1.9E-2,{"$f":"AH43*AI43","v":-2.790625E-2},null,null,null,{"$error":"#N/A"},{"$f":"IF(AND($AN$4<=15,$AN$4>13),15,0)","v":{"$error":"#N/A"}},{"$f":"IF(AND(AO43=15,$AM$4>=4,$AM$4<=5.99),AO43&\"-\"&\"1\",0)","v":{"$error":"#N/A"}},null,null,{"$error":"#N/A"},{"$f":"IF(AND($AS$4<=15,$AS$4>13),15,0)","v":{"$error":"#N/A"}},{"$f":"IF(AND(AT43=15,$AR$4>=4,$AR$4<=5.99),AT43&\"-\"&\"1\",0)","v":{"$error":"#N/A"}},null,{"$f":"IF(AY43>\"\",6,\"\")","v":""},"R-Value",{"$f":"IF(EXT_2=4,\"2.09\",\"\")","v":""},{"$f":"IF(EXT_2=4,\"3.98\",\"\")","v":""},{"$f":"IF(EXT_2=4,\"4.10\",\"\")","v":""},{"$f":"IF(EXT_2=4,\"3.98\",\"\")","v":""},null,null,null,null,null,null,null,null,null,null,null,null,{"$error":"#N/A"},{"$error":"#N/A"},{"$f":"IF(AND(BP43=14,$BN$4>=20,$BN$4<=22),BP43&\"E\",0)","v":{"$error":"#N/A"}},null,null,{"$error":"#N/A"},{"$error":"#N/A"},{"$f":"IF(AND(BU43=14,$BS$4>=20,$BS$4<=22),BU43&\"E\",0)","v":{"$error":"#N/A"}}]
[null,45,878,"OR",null,null,null,null,null,null,"6P2C",null,null,null,null,null,null,null,null,{"$f":"IF(_DIM4=(W/2),_DIM4-11.4375,IF(_DIM4>(W/2),_DIM4-11.4375,IF(_DIM4<(W/2),Frame_Width-_DIM4-11.4375,0)))","v":-11.4375},{"$f":"_DIM3-5.125","v":-5.125},null,null,null,null,null,null,null,null,"Top Sash",{"$f":"IF(ModelNo=\"A201\",(TRUNC((SUM(AE26:AE34))))+5,0)","v":0},null,null,null,"Top Sash",0,null,null,null,{"$error":"#N/A"},{"$error":"#N/A"},{"$f":"IF(AND(AO44=15,$AM$4>=6,$AM$4<=8.99),AO44&\"-\"&\"2\",0)","v":{"$error":"#N/A"}},null,null,{"$error":"#N/A"},{"$error":"#N/A"},{"$f":"IF(AND(AT44=15,$AR$4>=6,$AR$4<=8.99),AT44&\"-\"&\"2\",0)","v":{"$error":"#N/A"}},null,{"$f":"IF(AY44>\"\",7,\"\")","v":""},"U-Value",{"$f":"IF(EXT_2=4,\"0.48\",\"\")","v":""},{"$f":"IF(EXT_2=4,\"0.25\",\"\")","v":""},{"$f":"IF(EXT_2=4,\"0.244\",\"\")","v":""},{"$f":"IF(EXT_2=4,\"0.25\",\"\")","v":""},null,null,null,null,null,null,null,null,null,null,null,null,{"$error":"#N/A"},{"$error":"#N/A"},{"$f":"IF(AND(BP44=14,$BN$4>=23,$BN$4<=25),BP44&\"F\",0)","v":{"$error":"#N/A"}},null,null,{"$error":"#N/A"},{"$error":"#N/A"},{"$f":"IF(AND(BU44=14,$BS$4>=23,$BS$4<=25),BU44&\"F\",0)","v":{"$error":"#N/A"}}]
[null,46,878,"OR",null,null,null,null,null,null,"68CP",null,null,null,null,null,null,null,null,{"$f":"Frame_Width-_DIM4-11.4375","v":-11.4375},{"$f":"Frame_Height-5.125","v":-5.125},null,null,null,null,null,null,null,null,"Bottom Sash",{"$f":"IF(ModelNo=\"A201\",TRUNC((SUM(AE35:AE43))),0)","v":0},null,null,null,"Bottom Sash",{"$f":"IF(ModelNo=\"A991\",TRUNC(SUM(AJ35:AJ43)),0)","v":0},null,null,null,{"$error":"#N/A"},{"$error":"#N/A"},{"$f":"IF(AND(AO45=15,$AM$4>=9,$AM$4<=11.99),AO45&\"-\"&\"3\",0)","v":{"$error":"#N/A"}},null,null,{"$error":"#N/A"},{"$error":"#N/A"},{"$f":"IF(AND(AT45=15,$AR$4>=9,$AR$4<=11.99),AT45&\"-\"&\"3\",0)","v":{"$error":"#N/A"}},null,{"$f":"IF(AY45>\"\",8,\"\")","v":""},"Visible Light Transmittance",{"$f":"IF(EXT_2=4,\"81%\",\"\")","v":""},{"$f":"IF(EXT_2=4,\"72%\",\"\")","v":""},{"$f":"IF(EXT_2=4,\"64%\",\"\")","v":""},{"$f":"IF(EXT_2=4,\"72%\",\"\")","v":""},null,null,null,null,"CALDWELL BALANCE CHART A571",null,null,null,null,null,null,null,{"$error":"#N/A"},{"$error":"#N/A"},{"$f":"IF(AND(BP45=14,$BN$4>=26,$BN$4<=28),BP45&\"G\",0)","v":{"$error":"#N/A"}},null,null,{"$error":"#N/A"},{"$error":"#N/A"},{"$f":"IF(AND(BU45=14,$BS$4>=26,$BS$4<=28),BU45&\"G\",0)","v":{"$error":"#N/A"}}]
[null,47,888,"WT",null,null,null,null,null,null,"6CPX",null,null,null,null,null,null,null,null,{"$f":"Frame_Width-_DIM4-11.4375","v":-11.4375},{"$f":"Frame_Height-_DIM3-5.125","v":-5.125},null,null,null,null,null,null,null,null,null,null,null,null,null,null,null,null,null,null,{"$error":"#N/A"},{"$error":"#N/A"},{"$f":"IF(AND(AO46=15,$AM$4>=12,$AM$4<=15.99),AO46&\"-\"&\"4\",0)","v":{"$error":"#N/A"}},null,null,{"$error":"#N/A"},{"$error":"#N/A"},{"$f":"IF(AND(AT46=15,$AR$4>=12,$AR$4<=15.99),AT46&\"-\"&\"4\",0)","v":{"$error":"#N/A"}},null,{"$f":"IF(AY46>\"\",9,\"\")","v":""},"Ultraviolet Light Transmittance",{"$f":"IF(EXT_2=4,\"59%\",\"\")","v":""},{"$f":"IF(EXT_2=4,\"21%\",\"\")","v":""},{"$f":"IF(EXT_2=4,\"8%\",\"\")","v":""},{"$f":"IF(EXT_2=4,\"21%\",\"\")","v":""},null,null,null,null,"SASH HEIGHT",null,null,"Balance",null,null,null,null,{"$error":"#N/A"},{"$error":"#N/A"},{"$f":"IF(AND(BP46=14,$BN$4>=29,$BN$4<=31),BP46&\"H\",0)","v":{"$error":"#N/A"}},null,null,{"$error":"#N/A"},{"$error":"#N/A"},{"$f":"IF(AND(BU46=14,$BS$4>=29,$BS$4<=31),BU46&\"H\",0)","v":{"$error":"#N/A"}}]
[null,48,888,"WT",null,null,null,null,null,null,"6CPC",null,null,null,null,null,null,null,null,{"$f":"_DIM4-11.4375","v":-11.4375},{"$f":"Frame_Height-5.125","v":-5.125},null,null,null,null,null,null,null,null,null,null,null,null,null,null,null,null,null,null,{"$error":"#N/A"},{"$error":"#N/A"},{"$f":"IF(AND(AO47=15,$AM$4>=16,$AM$4<=18.99),AO47&\"-\"&\"5\",0)","v":{"$error":"#N/A"}},null,null,{"$error":"#N/A"},{"$error":"#N/A"},{"$f":"IF(AND(AT47=15,$AR$4>=16,$AR$4<=18.99),AT47&\"-\"&\"5\",0)","v":{"$error":"#N/A"}},"x",{"$f":"IF(AY47>\"\",10,\"\")","v":""},"Solar Heat Gain Coefficient",{"$f":"IF(EXT_2=4,\"0.75\",\"\")","v":""},{"$f":"IF(EXT_2=4,\"0.384\",\"\")","v":""},{"$f":"IF(EXT_2=4,\"0.361\",\"\")","v":""},{"$f":"IF(EXT_2=4,\"0.384\",\"\")","v":""},null,null,null,null,"RANGE",null,null,"Length",null,null,null,null,{"$error":"#N/A"},{"$error":"#N/A"},{"$f":"IF(AND(BP47=14,$BN$4>=32,$BN$4<=34),BP47&\"I\",0)","v":{"$error":"#N/A"}},null,null,{"$error":"#N/A"},{"$error":"#N/A"},{"$f":"IF(AND(BU47=14,$BS$4>=32,$BS$4<=34),BU47&\"I\",0)","v":{"$error":"#N/A"}}]
[null,49,889,"BN",null,null,null,null,null,null,"6CSP",null,null,null,null,null,null,null,null,{"$f":"_DIM4-11.4375","v":-11.4375},{"$f":"Frame_Height-_DIM3-5.125","v":-5.125},null,null,null,null,null,null,"A501","Length","Weight/ft","Weight",null,"02S0","Length","Weight/ft","Weight",null,null,null,{"$error":"#N/A"},{"$error":"#N/A"},{"$f":"IF(AND(AO48=15,$AM$4>=19,$AM$4<=22.99),AO48&\"-\"&\"6\",0)","v":{"$error":"#N/A"}},null,null,{"$error":"#N/A"},{"$error":"#N/A"},{"$f":"IF(AND(AT48=15,$AR$4>=19,$AR$4<=22.99),AT48&\"-\"&\"6\",0)","v":{"$error":"#N/A"}},null,null,null,null,null,null,null,null,null,null,null,10.375,"to",12.374000000000001,7,null,null,null,null,{"$error":"#N/A"},{"$error":"#N/A"},{"$f":"IF(AND(BP48=14,$BN$4>=35,$BN$4<=38),\"Dbl.\"&BP48&\"D\",0)","v":{"$error":"#N/A"}},null,null,{"$error":"#N/A"},{"$error":"#N/A"},{"$f":"IF(AND(BU48=14,$BS$4>=35,$BS$4<=38),\"Dbl.\"&BU48&\"D\",0)","v":{"$error":"#N/A"}}]
[null,50,889,"BN",null,null,null,null,null,null,"A690",null,null,null,null,null,null,null,null,null,null,null,null,null,null,null,null,"Top Top Rail",{"$f":"(Frame_Width-4.875)/12","v":-0.40625},0.36899999999999999,{"$f":"AC49*AD49","v":-0.14990624999999999},null,"Top Top Rail",0,0,{"$f":"AH49*AI49","v":0},null,null,null,{"$error":"#N/A"},{"$error":"#N/A"},{"$f":"IF(AND(AO49=15,$AM$4>=23,$AM$4<=25.99),AO49&\"-\"&\"9\",0)","v":{"$error":"#N/A"}},null,null,{"$error":"#N/A"},{"$error":"#N/A"},{"$f":"IF(AND(AT49=15,$AR$4>=23,$AR$4<=25.99),AT49&\"-\"&\"9\",0)","v":{"$error":"#N/A"}},null,null,null,null,null,null,null,null,null,null,null,12.375,"to",14.374000000000001,9,null,null,null,null,{"$error":"#N/A"},{"$error":"#N/A"},{"$f":"IF(AND(BP49=14,$BN$4>=39,$BN$4<=44),\"Dbl.\"&BP49&\"E\",0)","v":{"$error":"#N/A"}},null,null,{"$error":"#N/A"},{"$error":"#N/A"},{"$f":"IF(AND(BU49=14,$BS$4>=39,$BS$4<=44),\"Dbl.\"&BU49&\"E\",0)","v":{"$error":"#N/A"}}]
[null,51,899,"RD",null,null,null,null,null,null,"A691",null,null,null,null,null,null,null,null,null,null,null,null,null,null,null,null,"Top Bottom Rail",{"$f":"(Frame_Width-4.875)/12","v":-0.40625},0.36899999999999999,-0.14990624999999999,null,"Top Bottom Rail",0,0,{"$f":"AH50*AI50","v":0},null,null,null,{"$error":"#N/A"},{"$error":"#N/A"},{"$f":"IF(AND(AO50=15,$AM$4>=26,$AM$4<=26.99),AO50&\"-\"&\"11\",0)","v":{"$error":"#N/A"}},null,null,{"$error":"#N/A"},{"$error":"#N/A"},{"$f":"IF(AND(AT50=15,$AR$4>=26,$AR$4<=26.99),AT50&\"-\"&\"11\",0)","v":{"$error":"#N/A"}},null,null,null,1,2,3,4,5,null,null,null,14.375,"to",16.374000000000002,11,null,null,null,null,{"$error":"#N/A"},{"$error":"#N/A"},{"$f":"IF(AND(BP50=14,$BN$4>=45,$BN$4<=50),\"Dbl.\"&BP50&\"F\",0)","v":{"$error":"#N/A"}},null,null,{"$error":"#N/A"},{"$error":"#N/A"},{"$f":"IF(AND(BU50=14,$BS$4>=45,$BS$4<=50),\"Dbl.\"&BU50&\"F\",0)","v":{"$error":"#N/A"}}]
[null,52,899,"RD",null,null,null,null,null,null,"A692",null,null,null,null,null,null,null,null,{"$f":"Frame_Width-11.4375","v":-11.4375},{"$f":"Frame_Height-5.125","v":-5.125},null,null,null,null,null,null,"Top Stile",{"$f":"(2*(A501DDIM-1.6875))/12","v":-0.28125},0.36899999999999999,-0.10378124999999999,null,"Top Stile",0,0,{"$f":"(AH51*AI51)/12","v":0},null,null,null,{"$error":"#N/A"},{"$error":"#N/A"},{"$f":"IF(AND(AO51=15,$AM$4>=27,$AM$4<=29.99),AO51&\"-\"&\"12\",0)","v":{"$error":"#N/A"}},null,null,{"$error":"#N/A"},{"$error":"#N/A"},{"$f":"IF(AND(AT51=15,$AR$4>=27,$AR$4<=29.99),AT51&\"-\"&\"12\",0)","v":{"$error":"#N/A"}},null,null,"Outside Pane",{"$f":"VLOOKUP(1,$AW$5:$BC$47,3,FALSE)","v":{"$error":"#N/A"}},{"$f":"VLOOKUP(1,$AW$5:$BC$47,4,FALSE)","v":{"$error":"#N/A"}},{"$f":"VLOOKUP(1,$AW$5:$BC$47,5,FALSE)","v":{"$error":"#N/A"}},{"$f":"VLOOKUP(1,$AW$5:$BC$47,6,FALSE)","v":{"$error":"#N/A"}},{"$f":"VLOOKUP(1,$AW$5:$BC$47,7,FALSE)","v":{"$error":"#N/A"}},{"$f":"IF(Model_Select>1,HLOOKUP(Package_Select,$AY$50:$BC$60,2,FALSE),\"\")","v":{"$error":"#N/A"}},null,null,16.375,"to",18.374000000000002,13,null,null,null,null,{"$error":"#N/A"},{"$error":"#N/A"},{"$f":"IF(AND(BP51=14,$BN$4>=51,$BN$4<=56),\"Dbl.\"&BP51&\"G\",0)","v":{"$error":"#N/A"}},null,null,{"$error":"#N/A"},{"$error":"#N/A"},{"$f":"IF(AND(BU51=14,$BS$4>=51,$BS$4<=56),\"Dbl.\"&BU51&\"G\",0)","v":{"$error":"#N/A"}}]
[null,53,999,"NAT",null,null,null,null,null,null,"A770",null,null,null,null,null,null,null,null,null,null,null,null,null,null,null,null,"Top Rail Reinf.",{"$f":"(TRUNC(((Frame_Width-4.875)-6)/2)*2)/12","v":-0.83333333333333337},0.26400000000000001,-0.22000000000000003,null,"Top Rail Reinf.",0,0,0,null,null,null,{"$error":"#N/A"},{"$error":"#N/A"},{"$f":"IF(AND(AO52=15,$AM$4>=30,$AM$4<=32.99),AO52&\"-\"&\"13\",0)","v":{"$error":"#N/A"}},null,null,{"$error":"#N/A"},{"$error":"#N/A"},{"$f":"IF(AND(AT52=15,$AR$4>=30,$AR$4<=32.99),AT52&\"-\"&\"13\",0)","v":{"$error":"#N/A"}},null,null,"Middle Pane",{"$f":"VLOOKUP(2,$AW$5:$BC$47,3,FALSE)","v":{"$error":"#N/A"}},{"$f":"VLOOKUP(2,$AW$5:$BC$47,4,FALSE)","v":{"$error":"#N/A"}},{"$f":"VLOOKUP(2,$AW$5:$BC$47,5,FALSE)","v":{"$error":"#N/A"}},{"$f":"VLOOKUP(2,$AW$5:$BC$47,6,FALSE)","v":{"$error":"#N/A"}},{"$f":"VLOOKUP(2,$AW$5:$BC$47,7,FALSE)","v":{"$error":"#N/A"}},{"$f":"IF(Model_Select>1,HLOOKUP(Package_Select,$AY$50:$BC$60,3,FALSE),\"\")","v":{"$error":"#N/A"}},null,null,18.375,"to",20.374000000000002,15,null,null,null,null,{"$error":"#N/A"},{"$error":"#N/A"},{"$f":"IF(AND(BP52=14,$BN$4>=57,$BN$4<=62),\"Dbl.\"&BP52&\"H\",0)","v":{"$error":"#N/A"}},null,null,{"$error":"#N/A"},{"$error":"#N/A"},{"$f":"IF(AND(BU52=14,$BS$4>=57,$BS$4<=62),\"Dbl.\"&BU52&\"H\",0)","v":{"$error":"#N/A"}}]
[null,54,999,"NAT",null,null,null,null,null,null,"A780",null,null,null,null,null,null,null,null,null,null,null,null,null,null,null,null,"Top Glass",{"$f":"(CMR!L77*CMR!L79)/144","v":0.16109212239583334},{"$f":"$H$10","v":2.3140000000000001},0.37276717122395836,null,"Top Stile Reinf",0,0,0,null,null,null,{"$error":"#N/A"},{"$error":"#N/A"},{"$f":"IF(AND(AO53=15,$AM$4>=33,$AM$4<=34.99),AO53&\"-\"&\"14\",0)","v":{"$error":"#N/A"}},null,null,{"$error":"#N/A"},{"$error":"#N/A"},{"$f":"IF(AND(AT53=15,$AR$4>=33,$AR$4<=34.99),AT53&\"-\"&\"14\",0)","v":{"$error":"#N/A"}},null,null,"Inside Pane",{"$f":"VLOOKUP(3,$AW$5:$BC$47,3,FALSE)","v":{"$error":"#N/A"}},{"$f":"VLOOKUP(3,$AW$5:$BC$47,4,FALSE)","v":{"$error":"#N/A"}},{"$f":"VLOOKUP(3,$AW$5:$BC$47,5,FALSE)","v":{"$error":"#N/A"}},{"$f":"VLOOKUP(3,$AW$5:$BC$47,6,FALSE)","v":{"$error":"#N/A"}},{"$f":"VLOOKUP(3,$AW$5:$BC$47,7,FALSE)","v":{"$error":"#N/A"}},{"$f":"IF(Model_Select>1,HLOOKUP(Package_Select,$AY$50:$BC$60,4,FALSE),\"\")","v":{"$error":"#N/A"}},null,null,20.375,"to",22.374000000000002,17,null,null,null,null,{"$error":"#N/A"},{"$error":"#N/A"},{"$f":"IF(AND(BP53=14,$BN$4>=63,$BN$4<=68),\"Dbl.\"&BP53&\"I\",0)","v":{"$error":"#N/A"}},null,null,{"$error":"#N/A"},{"$error":"#N/A"},{"$f":"IF(AND(BU53=14,$BS$4>=63,$BS$4<=68),\"Dbl.\"&BU53&\"I\",0)","v":{"$error":"#N/A"}}]
[null,55,6679,"BU",null,null,null,null,null,null,"A890",null,null,null,null,null,null,null,null,null,null,null,null,null,null,null,null,"Top Spacer",{"$f":"((CMR!$L$77*2)+(CMR!$L$79*2))/12","v":-1.6927083333333333},5.3600000000000002E-2,-9.0729166666666666E-2,null,"Top Glass",0,0,0,null,null,null,{"$f":"IF(AND(AO54>0,AP54>0),AO54,0)","v":{"$error":"#N/A"}},{"$error":"#N/A"},{"$f":"IF(AND(AO54=15,$AM$4>=35,$AM$4<=37),AO54&\"-\"&\"15\",0)","v":{"$error":"#N/A"}},null,null,{"$error":"#N/A"},{"$error":"#N/A"},{"$f":"IF(AND(AT54=15,$AR$4>=35,$AR$4<=37),AT54&\"-\"&\"15\",0)","v":{"$error":"#N/A"}},null,null,"Spacer",{"$f":"VLOOKUP(4,$AW$5:$BC$47,3,FALSE)","v":{"$error":"#N/A"}},{"$f":"VLOOKUP(4,$AW$5:$BC$47,4,FALSE)","v":{"$error":"#N/A"}},{"$f":"VLOOKUP(4,$AW$5:$BC$47,5,FALSE)","v":{"$error":"#N/A"}},{"$f":"VLOOKUP(4,$AW$5:$BC$47,6,FALSE)","v":{"$error":"#N/A"}},{"$f":"VLOOKUP(4,$AW$5:$BC$47,7,FALSE)","v":{"$error":"#N/A"}},{"$f":"IF(Model_Select>1,HLOOKUP(Package_Select,$AY$50:$BC$60,5,FALSE),\"\")","v":{"$error":"#N/A"}},null,null,22.375,"to",24.374000000000002,19,null,null,null,null,{"$error":"#N/A"},{"$f":"IF(AND($BO$4<=16,$BO$4>14),16,0)","v":{"$error":"#N/A"}},{"$f":"IF(AND(BP54=16,$BN$4>=3,$BN$4<=7),BP54&\"A\",0)","v":{"$error":"#N/A"}},null,null,{"$error":"#N/A"},{"$f":"IF(AND($BT$4<=16,$BT$4>14),16,0)","v":{"$error":"#N/A"}},{"$f":"IF(AND(BU54=16,$BS$4>=3,$BS$4<=7),BU54&\"A\",0)","v":{"$error":"#N/A"}}]
[null,56,6679,"BU",null,null,null,null,null,null,"A990",null,null,null,null,null,null,null,null,null,null,null,null,null,null,null,null,"Top Hardware",1,0.2,0.2,null,"Top Spacer",0,0,0,null,null,null,{"$error":"#N/A"},{"$f":"IF(AND($AN$4<=17,$AN$4>15),17,0)","v":{"$error":"#N/A"}},{"$f":"IF(AND(AO55=17,$AM$4>=4,$AM$4<=5.99),AO55&\"-\"&\"1\",0)","v":{"$error":"#N/A"}},null,null,{"$error":"#N/A"},{"$f":"IF(AND($AS$4<=17,$AS$4>15),17,0)","v":{"$error":"#N/A"}},{"$f":"IF(AND(AT55=17,$AR$4>=4,$AR$4<=5.99),AT55&\"-\"&\"1\",0)","v":{"$error":"#N/A"}},null,null,"Gas",{"$f":"VLOOKUP(5,$AW$5:$BC$47,3,FALSE)","v":{"$error":"#N/A"}},{"$f":"VLOOKUP(5,$AW$5:$BC$47,4,FALSE)","v":{"$error":"#N/A"}},{"$f":"VLOOKUP(5,$AW$5:$BC$47,5,FALSE)","v":{"$error":"#N/A"}},{"$f":"VLOOKUP(5,$AW$5:$BC$47,6,FALSE)","v":{"$error":"#N/A"}},{"$f":"VLOOKUP(5,$AW$5:$BC$47,7,FALSE)","v":{"$error":"#N/A"}},{"$f":"IF(Model_Select>1,HLOOKUP(Package_Select,$AY$50:$BC$60,6,FALSE),\"\")","v":{"$error":"#N/A"}},null,null,24.375,"to",26.374000000000002,21,null,null,null,null,{"$error":"#N/A"},{"$error":"#N/A"},{"$f":"IF(AND(BP55=16,$BN$4>=8,$BN$4<=10),BP55&\"B\",0)","v":{"$error":"#N/A"}},null,null,{"$error":"#N/A"},{"$error":"#N/A"},{"$f":"IF(AND(BU55=16,$BS$4>=8,$BS$4<=10),BU55&\"B\",0)","v":{"$error":"#N/A"}}]
[null,57,6779,"LG",null,null,null,null,null,null,"A991",{"$f":"A991CDIM","v":0},{"$f":"A991CDIM-1.5","v":-1.5},{"$f":"A991CDIM-1.5","v":-1.5},{"$f":"AJ45","v":0},{"$f":"AJ44","v":0},null,null,null,{"$f":"Frame_Width-(1.75*2)","v":-3.5},{"$f":"A991CDIM-4","v":-4},null,null,null,null,null,null,"Top Handle Bead",{"$f":"(Frame_Width-6.5375)/12","v":-0.54479166666666667},0.104,-5.6658333333333331E-2,null,"Top Hardware",0,0,0,null,null,null,{"$error":"#N/A"},{"$error":"#N/A"},{"$f":"IF(AND(AO56=17,$AM$4>=6,$AM$4<=8.99),AO56&\"-\"&\"2\",0)","v":{"$error":"#N/A"}},null,null,{"$error":"#N/A"},{"$error":"#N/A"},{"$f":"IF(AND(AT56=17,$AR$4>=6,$AR$4<=8.99),AT56&\"-\"&\"2\",0)","v":{"$error":"#N/A"}},null,null,"R-Value",{"$f":"VLOOKUP(6,$AW$5:$BC$47,3,FALSE)","v":{"$error":"#N/A"}},{"$f":"VLOOKUP(6,$AW$5:$BC$47,4,FALSE)","v":{"$error":"#N/A"}},{"$f":"VLOOKUP(6,$AW$5:$BC$47,5,FALSE)","v":{"$error":"#N/A"}},{"$f":"VLOOKUP(6,$AW$5:$BC$47,6,FALSE)","v":{"$error":"#N/A"}},{"$f":"VLOOKUP(6,$AW$5:$BC$47,7,FALSE)","v":{"$error":"#N/A"}},{"$f":"IF(Model_Select>1,HLOOKUP(Package_Select,$AY$50:$BC$60,7,FALSE),\"\")","v":{"$error":"#N/A"}},null,null,26.375,"to",28.374000000000002,23,null,null,null,null,{"$error":"#N/A"},{"$error":"#N/A"},{"$f":"IF(AND(BP56=16,$BN$4>=11,$BN$4<=16),BP56&\"C\",0)","v":{"$error":"#N/A"}},null,null,{"$error":"#N/A"},{"$error":"#N/A"},{"$f":"IF(AND(BU56=16,$BS$4>=11,$BS$4<=16),BU56&\"C\",0)","v":{"$error":"#N/A"}}]
[null,58,6779,"LG",null,null,null,null,null,null,"02S0",{"$f":"S0CDIM","v":0},{"$f":"TRUNC((S0CDIM-0.75)*16+0.5)/16","v":-0.6875},null,{"$f":"AJ68","v":0},null,1.3125,7.3125,1.75,{"$f":"Frame_Width-4.5","v":-4.5},{"$f":"IF(TRUNC((Frame_Height-M57-R57)*16+0.5)/16<(TRUNC((L57-$Y$5-S57)*16+0.5)/16),TRUNC((Frame_Height-M57-R57)*16+0.5)/16,TRUNC((L57-$Y$5-S57)*16+0.5)/16)","v":{"$error":"#N/A"}},null,null,null,null,null,null,"Top Bead",{"$f":"((A501DDIM-4.5)*2+(Frame_Width-4.875))/12","v":-1.15625},7.3999999999999996E-2,-8.55625E-2,null,"Top Bead",0,0,0,null,null,null,{"$error":"#N/A"},{"$error":"#N/A"},{"$f":"IF(AND(AO57=17,$AM$4>=9,$AM$4<=11.99),AO57&\"-\"&\"3\",0)","v":{"$error":"#N/A"}},null,null,{"$error":"#N/A"},{"$error":"#N/A"},{"$f":"IF(AND(AT57=17,$AR$4>=9,$AR$4<=11.99),AT57&\"-\"&\"3\",0)","v":{"$error":"#N/A"}},null,null,"U-Value",{"$f":"VLOOKUP(7,$AW$5:$BC$47,3,FALSE)","v":{"$error":"#N/A"}},{"$f":"VLOOKUP(7,$AW$5:$BC$47,4,FALSE)","v":{"$error":"#N/A"}},{"$f":"VLOOKUP(7,$AW$5:$BC$47,5,FALSE)","v":{"$error":"#N/A"}},{"$f":"VLOOKUP(7,$AW$5:$BC$47,6,FALSE)","v":{"$error":"#N/A"}},{"$f":"VLOOKUP(7,$AW$5:$BC$47,7,FALSE)","v":{"$error":"#N/A"}},{"$f":"IF(Model_Select>1,HLOOKUP(Package_Select,$AY$50:$BC$60,8,FALSE),\"\")","v":{"$error":"#N/A"}},null,null,28.375,"to",30.374000000000002,25,null,null,null,null,{"$error":"#N/A"},{"$error":"#N/A"},{"$f":"IF(AND(BP57=16,$BN$4>=17,$BN$4<=19),BP57&\"D\",0)","v":{"$error":"#N/A"}},null,null,{"$error":"#N/A"},{"$error":"#N/A"},{"$f":"IF(AND(BU57=16,$BS$4>=17,$BS$4<=19),BU57&\"D\",0)","v":{"$error":"#N/A"}}]
[null,59,7779,"WT",null,null,null,null,null,null,"02S2",{"$f":"S2CDIM","v":0},{"$f":"TRUNC((S2CDIM-0.403)*32+0.5)/32","v":-0.375},null,null,null,null,null,null,{"$f":"S2CDIM-3.75","v":-3.75},{"$f":"Frame_Height-4.5","v":-4.5},null,null,null,null,null,null,"Bottom Top Rail",{"$f":"(Frame_Width-3.875)/12","v":-0.32291666666666669},0.47299999999999998,-0.15273958333333335,null,"Bottom Top Rail",{"$f":"(Frame_Width-2.25)/12","v":-0.1875},0.24099999999999999,{"$f":"AH58*AI58","v":-4.5187499999999999E-2},null,null,null,{"$error":"#N/A"},{"$error":"#N/A"},{"$f":"IF(AND(AO58=17,$AM$4>=12,$AM$4<=15.99),AO58&\"-\"&\"4\",0)","v":{"$error":"#N/A"}},null,null,{"$error":"#N/A"},{"$error":"#N/A"},{"$f":"IF(AND(AT58=17,$AR$4>=12,$AR$4<=15.99),AT58&\"-\"&\"4\",0)","v":{"$error":"#N/A"}},null,null,"Visible Light Transmittance",{"$f":"VLOOKUP(8,$AW$5:$BC$47,3,FALSE)","v":{"$error":"#N/A"}},{"$f":"VLOOKUP(8,$AW$5:$BC$47,4,FALSE)","v":{"$error":"#N/A"}},{"$f":"VLOOKUP(8,$AW$5:$BC$47,5,FALSE)","v":{"$error":"#N/A"}},{"$f":"VLOOKUP(8,$AW$5:$BC$47,6,FALSE)","v":{"$error":"#N/A"}},{"$f":"VLOOKUP(8,$AW$5:$BC$47,7,FALSE)","v":{"$error":"#N/A"}},{"$f":"IF(Model_Select>1,HLOOKUP(Package_Select,$AY$50:$BC$60,9,FALSE),\"\")","v":{"$error":"#N/A"}},null,null,30.375,"to",32.374000000000002,27,null,null,null,null,{"$error":"#N/A"},{"$error":"#N/A"},{"$f":"IF(AND(BP58=16,$BN$4>=20,$BN$4<=22),BP58&\"E\",0)","v":{"$error":"#N/A"}},null,null,{"$error":"#N/A"},{"$error":"#N/A"},{"$f":"IF(AND(BU58=16,$BS$4>=20,$BS$4<=22),BU58&\"E\",0)","v":{"$error":"#N/A"}}]
[null,60,7779,"WT",null,null,null,null,null,null,"02S3",{"$f":"S3CDIM","v":0.90625},{"$f":"TRUNC((S3CDIM-0.1875)*32+0.5)/32","v":0.71875},null,null,null,null,null,null,{"$f":"S3CDIM-3.375","v":-2.46875},{"$f":"Frame_Height-4.5","v":-4.5},null,null,null,null,null,null,"Bottom Bottom Rail",{"$f":"(Frame_Width-3.875)/12","v":-0.32291666666666669},0.437,-0.14111458333333335,null,"Bottom Bottom Rail",{"$f":"(Frame_Width-2.25)/12","v":-0.1875},0.25,-4.6875E-2,null,null,null,{"$error":"#N/A"},{"$error":"#N/A"},{"$f":"IF(AND(AO59=17,$AM$4>=16,$AM$4<=18.99),AO59&\"-\"&\"5\",0)","v":{"$error":"#N/A"}},null,null,{"$error":"#N/A"},{"$error":"#N/A"},{"$f":"IF(AND(AT59=17,$AR$4>=16,$AR$4<=18.99),AT59&\"-\"&\"5\",0)","v":{"$error":"#N/A"}},"x",null,"Ultraviolet Light Transmittance",{"$f":"VLOOKUP(9,$AW$5:$BC$47,3,FALSE)","v":{"$error":"#N/A"}},{"$f":"VLOOKUP(9,$AW$5:$BC$47,4,FALSE)","v":{"$error":"#N/A"}},{"$f":"VLOOKUP(9,$AW$5:$BC$47,5,FALSE)","v":{"$error":"#N/A"}},{"$f":"VLOOKUP(9,$AW$5:$BC$47,6,FALSE)","v":{"$error":"#N/A"}},{"$f":"VLOOKUP(9,$AW$5:$BC$47,7,FALSE)","v":{"$error":"#N/A"}},{"$f":"IF(Model_Select>1,HLOOKUP(Package_Select,$AY$50:$BC$60,10,FALSE),\"\")","v":{"$error":"#N/A"}},null,null,32.375,"to",34.374000000000002,29,null,null,null,null,{"$error":"#N/A"},{"$error":"#N/A"},{"$f":"IF(AND(BP59=16,$BN$4>=23,$BN$4<=24),BP59&\"F\",0)","v":{"$error":"#N/A"}},null,null,{"$error":"#N/A"},{"$error":"#N/A"},{"$f":"IF(AND(BU59=16,$BS$4>=23,$BS$4<=24),BU59&\"F\",0)","v":{"$error":"#N/A"}}]
[null,61,6799,"OR",null,null,null,null,null,null,"02S4",null,null,null,null,null,null,null,null,null,null,null,null,null,null,null,null,"Bottom Stile",{"$f":"(2*(A501CDIM-0.6875))/12","v":-0.11458333333333333},0.437,-5.0072916666666661E-2,null,"Bottom Stile",{"$f":"((S0CDIM-0.75)*2)/12","v":-0.125},0.23,-2.8750000000000001E-2,null,null,null,{"$error":"#N/A"},{"$error":"#N/A"},{"$f":"IF(AND(AO60=17,$AM$4>=19,$AM$4<=22.99),AO60&\"-\"&\"6\",0)","v":{"$error":"#N/A"}},null,null,{"$error":"#N/A"},{"$error":"#N/A"},{"$f":"IF(AND(AT60=17,$AR$4>=19,$AR$4<=22.99),AT60&\"-\"&\"6\",0)","v":{"$error":"#N/A"}},null,null,"Solar Heat Gain Coefficient",{"$f":"VLOOKUP(10,$AW$5:$BC$47,3,FALSE)","v":{"$error":"#N/A"}},{"$f":"VLOOKUP(10,$AW$5:$BC$47,4,FALSE)","v":{"$error":"#N/A"}},{"$f":"VLOOKUP(10,$AW$5:$BC$47,5,FALSE)","v":{"$error":"#N/A"}},{"$f":"VLOOKUP(10,$AW$5:$BC$47,6,FALSE)","v":{"$error":"#N/A"}},{"$f":"VLOOKUP(10,$AW$5:$BC$47,7,FALSE)","v":{"$error":"#N/A"}},{"$f":"IF(Model_Select>1,HLOOKUP(Package_Select,$AY$50:$BC$60,11,FALSE),\"\")","v":{"$error":"#N/A"}},null,null,34.375,"to",36.374000000000002,31,null,null,null,null,{"$error":"#N/A"},{"$error":"#N/A"},{"$f":"IF(AND(BP60=16,$BN$4>=25,$BN$4<=28),BP60&\"G\",0)","v":{"$error":"#N/A"}},null,null,{"$error":"#N/A"},{"$error":"#N/A"},{"$f":"IF(AND(BU60=16,$BS$4>=25,$BS$4<=28),BU60&\"G\",0)","v":{"$error":"#N/A"}}]
[null,62,6799,"OR",null,null,null,null,null,null,"02S9",{"$f":"S9CDIM","v":0.25},{"$f":"TRUNC((S9CDIM-0.1875)*32+0.5)/32","v":6.25E-2},null,null,null,null,null,null,{"$f":"S9CDIM-4.375","v":-4.125},{"$f":"Frame_Height-4.5","v":-4.5},null,null,null,null,null,null,"Bottom Rail Reinf.",{"$f":"(TRUNC(((Frame_Width-3.875)-6)/2)*2)/12","v":-0.66666666666666663},0.43440000000000001,-0.28959999999999997,null,"Bottom Rail Reinf.",{"$f":"(TRUNC(((AH58*12)-6)/2)*2)/12","v":-0.66666666666666663},0.32800000000000001,-0.21866666666666668,null,null,null,{"$error":"#N/A"},{"$error":"#N/A"},{"$f":"IF(AND(AO61=17,$AM$4>=23,$AM$4<=25.99),AO61&\"-\"&\"9\",0)","v":{"$error":"#N/A"}},null,null,{"$error":"#N/A"},{"$error":"#N/A"},{"$f":"IF(AND(AT61=17,$AR$4>=23,$AR$4<=25.99),AT61&\"-\"&\"9\",0)","v":{"$error":"#N/A"}},null,null,null,null,null,null,null,null,null,null,null,36.375,"to",38.374000000000002,33,null,null,null,null,{"$error":"#N/A"},{"$error":"#N/A"},{"$f":"IF(AND(BP61=16,$BN$4>=29,$BN$4<=31),BP61&\"H\",0)","v":{"$error":"#N/A"}},null,null,{"$error":"#N/A"},{"$error":"#N/A"},{"$f":"IF(AND(BU61=16,$BS$4>=29,$BS$4<=31),BU61&\"H\",0)","v":{"$error":"#N/A"}}]
[null,63,7799,"BN",null,null,null,null,null,null,"3A01",{"$f":"CDIM3A01","v":0},{"$f":"CDIM3A01-0.625","v":-0.625},null,{"$f":"BSW3A01","v":0},{"$f":"TSW3A01","v":0},1.3125,7.875,1.875,{"$f":"Frame_Width-5.25","v":-5.25},{"$f":"IF(TRUNC((Frame_Height-M62-R62)*16+0.5)/16<(TRUNC((L62-$Y$5-S62)*16+0.5)/16),TRUNC((Frame_Height-M62-R62)*16+0.5)/16,TRUNC((L62-$Y$5-S62)*16+0.5)/16)","v":{"$error":"#N/A"}},null,null,null,null,null,null,"Bottom Stile Reinf.",0,0,0,null,"Bottom Stile Reinf.",{"$f":"IF(S0CDIM>=27.5,(((S0CDIM-4.5)/2)*2)/12,0)","v":0},0.23799999999999999,0,null,null,null,{"$error":"#N/A"},{"$error":"#N/A"},{"$f":"IF(AND(AO62=17,$AM$4>=26,$AM$4<=26.99),AO62&\"-\"&\"11\",0)","v":{"$error":"#N/A"}},null,null,{"$error":"#N/A"},{"$error":"#N/A"},{"$f":"IF(AND(AT62=17,$AR$4>=26,$AR$4<=26.99),AT62&\"-\"&\"11\",0)","v":{"$error":"#N/A"}},null,null,null,null,null,null,null,null,null,null,null,38.375,"to",40.374000000000002,35,null,null,null,null,{"$error":"#N/A"},{"$error":"#N/A"},{"$f":"IF(AND(BP62=16,$BN$4>=32,$BN$4<=34),BP62&\"I\",0)","v":{"$error":"#N/A"}},null,null,{"$error":"#N/A"},{"$error":"#N/A"},{"$f":"IF(AND(BU62=16,$BS$4>=32,$BS$4<=34),BU62&\"I\",0)","v":{"$error":"#N/A"}}]
[null,64,7799,"BN",null,null,null,null,null,null,"03S0",{"$f":"CDIM03S0","v":0},{"$f":"CDIM03S0-1.125","v":-1.125},null,{"$f":"BSW03S0","v":0},0,1.3125,7.875,1.875,{"$f":"Frame_Width-5.8125","v":-5.8125},{"$f":"IF(TRUNC((Frame_Height-M63-R63)*16+0.5)/16<(TRUNC((L63-$Y$5-S63)*16+0.5)/16),TRUNC((Frame_Height-M63-R63)*16+0.5)/16,TRUNC((L63-$Y$5-S63)*16+0.5)/16)","v":{"$error":"#N/A"}},null,null,null,null,null,null,"Bottom Glass",{"$f":"(CMR!$L$78*CMR!$L$80)/144","v":0.16109212239583334},{"$f":"$H$10","v":2.3140000000000001},0.37276717122395836,null,"Bottom Glass",{"$f":"(CMR!L30*CMR!L32)/144","v":6.3910590277777776E-2},{"$f":"$H$10","v":2.3140000000000001},0.14788910590277779,null,null,null,{"$error":"#N/A"},{"$error":"#N/A"},{"$f":"IF(AND(AO63=17,$AM$4>=27,$AM$4<=29.99),AO63&\"-\"&\"12\",0)","v":{"$error":"#N/A"}},null,null,{"$error":"#N/A"},{"$error":"#N/A"},{"$f":"IF(AND(AT63=17,$AR$4>=27,$AR$4<=29.99),AT63&\"-\"&\"12\",0)","v":{"$error":"#N/A"}},null,null,null,null,null,null,null,null,null,null,null,40.375,"to",42.374000000000002,37,null,null,null,null,{"$error":"#N/A"},{"$error":"#N/A"},{"$f":"IF(AND(BP63=16,$BN$4>=35,$BN$4<=36),\"Dbl.\"&BP63&\"D\",0)","v":{"$error":"#N/A"}},null,null,{"$error":"#N/A"},{"$error":"#N/A"},{"$f":"IF(AND(BU63=16,$BS$4>=35,$BS$4<=36),\"Dbl.\"&BU63&\"D\",0)","v":{"$error":"#N/A"}}]
[null,65,7899,"GN",null,null,null,null,null,null,"A140",{"$f":"CDIMA140","v":0},{"$f":"Data!D663","v":-1.125},null,{"$f":"BSW03S0","v":0},0,1.3125,1.875,1.875,{"$f":"Frame_Width-5.8125","v":-5.8125},{"$f":"TRUNC((LEG-M64-R64)*16+0.5)/16","v":-0.6875},null,null,null,null,null,null,"Bottom Spacer",{"$f":"((CMR!$L$78*2)+(CMR!$L$80*2))/12","v":-1.6927083333333333},5.3600000000000002E-2,-9.0729166666666666E-2,null,"Bottom Spacer",{"$f":"((CMR!L30*2)+(CMR!L32*2))/12","v":-1.0416666666666667},5.3600000000000002E-2,{"$f":"AH64*AI64","v":-5.5833333333333339E-2},null,null,null,{"$error":"#N/A"},{"$error":"#N/A"},{"$f":"IF(AND(AO64=17,$AM$4>=30,$AM$4<=32.99),AO64&\"-\"&\"13\",0)","v":{"$error":"#N/A"}},null,null,{"$error":"#N/A"},{"$error":"#N/A"},{"$f":"IF(AND(AT64=17,$AR$4>=30,$AR$4<=32.99),AT64&\"-\"&\"13\",0)","v":{"$error":"#N/A"}},null,null,null,null,null,null,null,null,null,null,null,42.375,"to",44.374000000000002,39,null,null,null,null,{"$error":"#N/A"},{"$error":"#N/A"},{"$f":"IF(AND(BP64=16,$BN$4>=37,$BN$4<=44),\"Dbl.\"&BP64&\"E\",0)","v":{"$error":"#N/A"}},null,null,{"$error":"#N/A"},{"$error":"#N/A"},{"$f":"IF(AND(BU64=16,$BS$4>=37,$BS$4<=44),\"Dbl.\"&BU64&\"E\",0)","v":{"$error":"#N/A"}}]
[null,66,7899,"GN",null,null,null,null,null,null,"A144",{"$f":"CDIMA140","v":0},{"$f":"Data!D663","v":-1.125},null,{"$f":"BSW03S0","v":0},0,1.3125,1.875,1.875,{"$f":"Frame_Width-5.8125","v":-5.8125},{"$f":"TRUNC((LEG-M65-R65)*16+0.5)/16","v":-0.6875},null,null,null,null,null,null,"Bottom Hardware",1,0.36,0.36,null,"Bottom Hardware",1,0.36,{"$f":"AH65*AI65","v":0.36},null,null,null,{"$error":"#N/A"},{"$error":"#N/A"},{"$f":"IF(AND(AO65=17,$AM$4>=33,$AM$4<=34.99),AO65&\"-\"&\"14\",0)","v":{"$error":"#N/A"}},null,null,{"$error":"#N/A"},{"$error":"#N/A"},{"$f":"IF(AND(AT65=17,$AR$4>=33,$AR$4<=34.99),AT65&\"-\"&\"14\",0)","v":{"$error":"#N/A"}},null,null,null,null,null,null,null,null,null,null,null,44.375,"to",46.374000000000002,41,null,null,null,null,{"$error":"#N/A"},{"$error":"#N/A"},{"$f":"IF(AND(BP65=16,$BN$4>=45,$BN$4<=48),\"Dbl.\"&BP65&\"F\",0)","v":{"$error":"#N/A"}},null,null,{"$error":"#N/A"},{"$error":"#N/A"},{"$f":"IF(AND(BU65=16,$BS$4>=45,$BS$4<=48),\"Dbl.\"&BU65&\"F\",0)","v":{"$error":"#N/A"}}]
[null,67,8899,"RD",null,null,null,null,null,null,"A146",{"$f":"CDIMA140","v":0},{"$f":"Data!D663","v":-1.125},null,{"$f":"BSW03S0","v":0},0,1.3125,1.875,1.875,{"$f":"Frame_Width-5.8125","v":-5.8125},{"$f":"TRUNC((LEG-M66-R66)*16+0.5)/16","v":-0.6875},null,null,null,null,null,null,"Bott. Handle Bead",{"$f":"(Frame_Width-6.5375)/12","v":-0.54479166666666667},0.109,-5.938229166666667E-2,null,"Bottom Bead",{"$f":"(((Frame_Width-3.3125)*2)+((S0CDIM-1.8125)*2))/12","v":-0.85416666666666663},2.8000000000000001E-2,{"$f":"AH66*AI66","v":-2.3916666666666666E-2},null,null,null,{"$f":"IF(AND(AO66>0,AP66>0),AO66,0)","v":{"$error":"#N/A"}},{"$error":"#N/A"},{"$f":"IF(AND(AO66=17,$AM$4>=35,$AM$4<=38),AO66&\"-\"&\"15\",0)","v":{"$error":"#N/A"}},null,null,{"$error":"#N/A"},{"$error":"#N/A"},{"$f":"IF(AND(AT66=17,$AR$4>=35,$AR$4<=38),AT66&\"-\"&\"15\",0)","v":{"$error":"#N/A"}},null,null,null,null,null,null,null,null,null,null,null,46.375,"to",48.374000000000002,43,null,null,null,null,{"$error":"#N/A"},{"$error":"#N/A"},{"$f":"IF(AND(BP66=16,$BN$4>=49,$BN$4<=56),\"Dbl.\"&BP66&\"G\",0)","v":{"$error":"#N/A"}},null,null,{"$error":"#N/A"},{"$error":"#N/A"},{"$f":"IF(AND(BU66=16,$BS$4>=49,$BS$4<=56),\"Dbl.\"&BU66&\"G\",0)","v":{"$error":"#N/A"}}]
[null,68,8899,"RD",null,null,null,null,null,null,"A740",{"$f":"CDIMA740","v":0},{"$f":"Data!D157","v":-0.875},null,{"$f":"BSWA571","v":0},0,null,null,{"$f":"1.4375+1.25","v":2.6875},{"$f":"Frame_Width-(1.625*2)","v":-3.25},{"$f":"IF((LEG-M67-1.625)<(CDIMA740-S67),LEG-M67-1.625,CDIMA740-S67)","v":-2.6875},null,null,null,null,null,null,"Bottom Bead",{"$f":"((A501CDIM-4.5)*2)/12","v":-0.75},7.3999999999999996E-2,-5.5499999999999994E-2,null,null,null,"Top Sash",0,null,null,null,{"$error":"#N/A"},{"$f":"IF(AND($AN$4<=19,$AN$4>17),19,0)","v":{"$error":"#N/A"}},{"$f":"IF(AND(AO67=19,$AM$4>=4,$AM$4<=6.99),AO67&\"-\"&\"1\",0)","v":{"$error":"#N/A"}},null,null,{"$error":"#N/A"},{"$f":"IF(AND($AS$4<=19,$AS$4>17),19,0)","v":{"$error":"#N/A"}},{"$f":"IF(AND(AT67=19,$AR$4>=4,$AR$4<=6.99),AT67&\"-\"&\"1\",0)","v":{"$error":"#N/A"}},null,null,null,null,null,null,null,null,null,null,null,48.375,"to",50.374000000000002,45,null,null,null,null,{"$error":"#N/A"},{"$error":"#N/A"},{"$f":"IF(AND(BP67=16,$BN$4>=57,$BN$4<=62),\"Dbl.\"&BP67&\"H\",0)","v":{"$error":"#N/A"}},null,null,{"$error":"#N/A"},{"$error":"#N/A"},{"$f":"IF(AND(BU67=16,$BS$4>=57,$BS$4<=62),\"Dbl.\"&BU67&\"H\",0)","v":{"$error":"#N/A"}}]
[null,69,8999,"YW",null,null,null,null,null,null,"A744",{"$f":"CDIMA740","v":0},{"$f":"Data!D157","v":-0.875},null,{"$f":"BSWA571","v":0},0,null,null,{"$f":"1.4375+1.25","v":2.6875},{"$f":"Frame_Width-(1.625*2)","v":-3.25},{"$f":"IF((LEG-M68-1.6255)<(CDIMA740-S68),LEG-M68-1.625,CDIMA740-S68)","v":-2.6875},null,null,null,null,null,null,null,null,"Top Sash",{"$f":"IF(ModelNo=\"A501\",(TRUNC((SUM(AE49:AE57))))+5,0)","v":0},null,null,null,"Bottom Sash",{"$f":"IF(ModelNo=\"02S0\",TRUNC(SUM(AJ58:AJ66)),0)","v":0},null,null,null,{"$error":"#N/A"},{"$error":"#N/A"},{"$f":"IF(AND(AO68=19,$AM$4>=7,$AM$4<=9.99),AO68&\"-\"&\"2\",0)","v":{"$error":"#N/A"}},null,null,{"$error":"#N/A"},{"$error":"#N/A"},{"$f":"IF(AND(AT68=19,$AR$4>=7,$AR$4<=9.99),AT68&\"-\"&\"2\",0)","v":{"$error":"#N/A"}},null,null,null,null,null,null,null,null,null,null,null,null,null,null,null,null,null,null,null,{"$error":"#N/A"},{"$error":"#N/A"},{"$f":"IF(AND(BP68=16,$BN$4>=63,$BN$4<=68),\"Dbl.\"&BP68&\"I\",0)","v":{"$error":"#N/A"}},null,null,{"$error":"#N/A"},{"$error":"#N/A"},{"$f":"IF(AND(BU68=16,$BS$4>=63,$BS$4<=68),\"Dbl.\"&BU68&\"I\",0)","v":{"$error":"#N/A"}}]
[null,70,8999,"YW",null,null,null,null,null,null,"A746",{"$f":"CDIMA740","v":0},{"$f":"Data!D157","v":-0.875},null,{"$f":"BSWA571","v":0},0,null,null,{"$f":"1.4375+1.25","v":2.6875},{"$f":"Frame_Width-(1.625*2)","v":-3.25},{"$f":"IF((LEG-M69-1.625)<(CDIMA740-S69),LEG-M69-1.625,CDIMA740-S69)","v":-2.6875},null,null,null,null,null,null,null,null,"Bottom Sash",{"$f":"IF(ModelNo=\"A501\",TRUNC((SUM(AE58:AE67))),0)","v":0},null,null,null,null,null,null,null,null,{"$error":"#N/A"},{"$error":"#N/A"},{"$f":"IF(AND(AO69=19,$AM$4>=10,$AM$4<=13.99),AO69&\"-\"&\"3\",0)","v":{"$error":"#N/A"}},null,null,{"$error":"#N/A"},{"$error":"#N/A"},{"$f":"IF(AND(AT69=19,$AR$4>=10,$AR$4<=13.99),AT69&\"-\"&\"3\",0)","v":{"$error":"#N/A"}},null,null,null,null,null,null,null,null,null,null,null,null,null,null,null,null,null,null,null,{"$f":"IF(AND(BP69>0,BQ69>0),BP69,0)","v":{"$error":"#N/A"}},{"$f":"IF(AND($BO$4<=18,$BO$4>16),18,0)","v":{"$error":"#N/A"}},{"$f":"IF(AND(BP69=18,$BN$4>=4,$BN$4<=9),BP69&\"A\",0)","v":{"$error":"#N/A"}},null,null,{"$f":"IF(AND(BU69>0,BV69>0),BU69,0)","v":{"$error":"#N/A"}},{"$f":"IF(AND($BT$4<=18,$BT$4>16),18,0)","v":{"$error":"#N/A"}},{"$f":"IF(AND(BU69=18,$BS$4>=4,$BS$4<=9),BU69&\"A\",0)","v":{"$error":"#N/A"}}]
[null,71,9999,"PU",null,null,null,null,null,null,"A840",{"$f":"CDIMA840","v":0},{"$f":"Data!D175","v":-1.5},null,{"$f":"BSWA581","v":0},0,null,null,{"$f":"1.75+1.5","v":3.25},{"$f":"Frame_Width-(1.75*2)","v":-3.5},{"$f":"IF((LEG-M70-1.75)<(CDIMA840-S70),LEG-M70-1.75,CDIMA840-S70)","v":-3.25},null,null,null,null,null,null,null,null,null,null,null,null,null,null,null,null,null,null,{"$error":"#N/A"},{"$error":"#N/A"},{"$f":"IF(AND(AO70=19,$AM$4>=14,$AM$4<=18.99),AO70&\"-\"&\"4\",0)","v":{"$error":"#N/A"}},null,null,{"$error":"#N/A"},{"$error":"#N/A"},{"$f":"IF(AND(AT70=19,$AR$4>=14,$AR$4<=18.99),AT70&\"-\"&\"4\",0)","v":{"$error":"#N/A"}},"x",null,null,null,null,null,null,null,null,null,null,null,null,null,null,null,null,null,null,{"$error":"#N/A"},{"$error":"#N/A"},{"$f":"IF(AND(BP70=18,$BN$4>=10,$BN$4<=13),BP70&\"B\",0)","v":{"$error":"#N/A"}},null,null,{"$error":"#N/A"},{"$error":"#N/A"},{"$f":"IF(AND(BU70=18,$BS$4>=10,$BS$4<=13),BU70&\"B\",0)","v":{"$error":"#N/A"}}]
[null,72,9999,"PU",null,null,null,null,null,null,"A844",{"$f":"CDIMA840","v":0},{"$f":"Data!D175","v":-1.5},null,{"$f":"BSWA581","v":0},0,null,null,{"$f":"1.75+1.5","v":3.25},{"$f":"Frame_Width-(1.75*2)","v":-3.5},{"$f":"IF((LEG-M70-1.75)<(CDIMA840-S70),LEG-M70-1.75,CDIMA840-S70)","v":-3.25},null,null,null,null,null,null,"3A01","Length","Weight/ft","Weight",null,"03S0","Length","Weight/ft","Weight",null,null,null,{"$error":"#N/A"},{"$error":"#N/A"},{"$f":"IF(AND(AO71=19,$AM$4>=19,$AM$4<=23.99),AO71&\"-\"&\"5\",0)","v":{"$error":"#N/A"}},null,null,{"$error":"#N/A"},{"$error":"#N/A"},{"$f":"IF(AND(AT71=19,$AR$4>=19,$AR$4<=23.99),AT71&\"-\"&\"5\",0)","v":{"$error":"#N/A"}},null,null,null,null,null,null,null,null,null,null,null,null,null,null,null,null,null,null,null,{"$error":"#N/A"},{"$error":"#N/A"},{"$f":"IF(AND(BP71=18,$BN$4>=14,$BN$4<=18),BP71&\"C\",0)","v":{"$error":"#N/A"}},null,null,{"$error":"#N/A"},{"$error":"#N/A"},{"$f":"IF(AND(BU71=18,$BS$4>=14,$BS$4<=18),BU71&\"C\",0)","v":{"$error":"#N/A"}}]
[null,null,null,null,null,null,null,null,null,null,"A846",{"$f":"CDIMA840","v":0},{"$f":"Data!D175","v":-1.5},null,{"$f":"BSWA581","v":0},0,null,null,{"$f":"1.75+1.5","v":3.25},{"$f":"Frame_Width-(1.75*2)","v":-3.5},{"$f":"IF((LEG-M70-1.75)<(CDIMA840-S70),LEG-M70-1.75,CDIMA840-S70)","v":-3.25},null,null,null,null,null,null,"Top Top Rail",{"$f":"(Frame_Width-4.125)/12","v":-0.34375},0.29699999999999999,{"$f":"AC72*AD72","v":-0.10209375},null,"Top Top Rail",0,0,{"$f":"AH72*AI72","v":0},null,null,null,{"$error":"#N/A"},{"$error":"#N/A"},{"$f":"IF(AND(AO72=19,$AM$4>=24,$AM$4<=26.99),AO72&\"-\"&\"6\",0)","v":{"$error":"#N/A"}},null,null,{"$error":"#N/A"},{"$error":"#N/A"},{"$f":"IF(AND(AT72=19,$AR$4>=24,$AR$4<=26.99),AT72&\"-\"&\"6\",0)","v":{"$error":"#N/A"}},null,null,null,null,null,null,null,null,null,null,null,null,null,null,null,null,null,null,null,{"$error":"#N/A"},{"$error":"#N/A"},{"$f":"IF(AND(BP72=18,$BN$4>=19,$BN$4<=21),BP72&\"D\",0)","v":{"$error":"#N/A"}},null,null,{"$error":"#N/A"},{"$error":"#N/A"},{"$f":"IF(AND(BU72=18,$BS$4>=19,$BS$4<=21),BU72&\"D\",0)","v":{"$error":"#N/A"}}]
[null,null,null,null,null,null,null,null,null,null,"7SH2",{"$f":"CDIM7SH2","v":0},{"$f":"CDIM7SH2-0.875","v":-0.875},null,{"$f":"AE115","v":0},null,null,null,null,{"$f":"(Frame_Width/2)-(1.625*2)","v":-3.25},{"$f":"CDIM7SH2-3.75","v":-3.75},null,null,null,null,null,null,"Top Bottom Rail",{"$f":"(Frame_Width-4.125)/12","v":-0.34375},0.28899999999999998,-9.9343749999999995E-2,null,"Top Bottom Rail",0,0,{"$f":"AH73*AI73","v":0},null,null,null,{"$error":"#N/A"},{"$error":"#N/A"},{"$f":"IF(AND(AO73=19,$AM$4>=27,$AM$4<=29.99),AO73&\"-\"&\"9\",0)","v":{"$error":"#N/A"}},null,null,{"$error":"#N/A"},{"$error":"#N/A"},{"$f":"IF(AND(AT73=19,$AR$4>=27,$AR$4<=29.99),AT73&\"-\"&\"9\",0)","v":{"$error":"#N/A"}},null,null,null,null,null,null,null,null,null,null,null,null,null,null,null,null,null,null,null,{"$error":"#N/A"},{"$error":"#N/A"},{"$f":"IF(AND(BP73=18,$BN$4>=22,$BN$4<=24),BP73&\"E\",0)","v":{"$error":"#N/A"}},null,null,{"$error":"#N/A"},{"$error":"#N/A"},{"$f":"IF(AND(BU73=18,$BS$4>=22,$BS$4<=24),BU73&\"E\",0)","v":{"$error":"#N/A"}}]
[null,4,3,1,null,null,null,null,null,null,"7SH3",{"$f":"CDIM7SH3","v":0},{"$f":"CDIM7SH3-0.875","v":-0.875},null,{"$f":"AE137","v":0},null,null,null,null,{"$f":"(Frame_Width/3)-(1.625*2)","v":-3.25},{"$f":"CDIM7SH3-3.75","v":-3.75},null,null,null,null,null,null,"Top Stile",{"$f":"(2*(DDIM3A01-1.625))/12","v":-0.27083333333333331},0.218,-5.9041666666666666E-2,null,"Top Stile",0,0,{"$f":"(AH74*AI74)/12","v":0},null,null,null,{"$error":"#N/A"},{"$error":"#N/A"},{"$f":"IF(AND(AO74=19,$AM$4>=30,$AM$4<=30.99),AO74&\"-\"&\"11\",0)","v":{"$error":"#N/A"}},null,null,{"$error":"#N/A"},{"$error":"#N/A"},{"$f":"IF(AND(AT74=19,$AR$4>=30,$AR$4<=30.99),AT74&\"-\"&\"11\",0)","v":{"$error":"#N/A"}},null,null,null,null,null,null,null,null,null,null,null,null,null,null,null,null,null,null,null,{"$error":"#N/A"},{"$error":"#N/A"},{"$f":"IF(AND(BP74=18,$BN$4>=25,$BN$4<=26),BP74&\"F\",0)","v":{"$error":"#N/A"}},null,null,{"$error":"#N/A"},{"$error":"#N/A"},{"$f":"IF(AND(BU74=18,$BS$4>=25,$BS$4<=26),BU74&\"F\",0)","v":{"$error":"#N/A"}}]
[null,{"$f":"B74+1","v":5},3,1,null,null,null,null,null,null,"8SH2",{"$f":"CDIM8SH2","v":0},{"$f":"CDIM8SH2-0.875","v":-0.875},null,{"$f":"AJ115","v":0},null,null,null,null,{"$f":"(Frame_Width/2)-(1.75*2)","v":-3.5},{"$f":"CDIM8SH2-3.5","v":-3.5},null,null,null,null,null,null,"Top Rail Reinf.",{"$f":"(TRUNC(((Frame_Width-4.125)-6)/2)*2)/12","v":-0.83333333333333337},{"$f":"IF(OR(EXTSELECT=2,Frame_Width<48,Frame_Height<84),0.0516,IF(OR(EXTSELECT=3,Frame_Width>48,Frame_Height>84),0.3784,0))","v":5.16E-2},-4.3000000000000003E-2,null,"Top Rail Reinf.",0,0,0,null,null,null,{"$error":"#N/A"},{"$error":"#N/A"},{"$f":"IF(AND(AO75=19,$AM$4>=31,$AM$4<=33.99),AO75&\"-\"&\"12\",0)","v":{"$error":"#N/A"}},null,null,{"$error":"#N/A"},{"$error":"#N/A"},{"$f":"IF(AND(AT75=19,$AR$4>=31,$AR$4<=33.99),AT75&\"-\"&\"12\",0)","v":{"$error":"#N/A"}},null,null,null,null,null,null,null,null,null,null,null,null,null,null,null,null,null,null,null,{"$error":"#N/A"},{"$error":"#N/A"},{"$f":"IF(AND(BP75=18,$BN$4>=27,$BN$4<=29),BP75&\"G\",0)","v":{"$error":"#N/A"}},null,null,{"$error":"#N/A"},{"$error":"#N/A"},{"$f":"IF(AND(BU75=18,$BS$4>=27,$BS$4<=29),BU75&\"G\",0)","v":{"$error":"#N/A"}}]
[null,6,3,1,null,null,null,null,null,null,"8SH3",{"$f":"CDIM8SH3","v":0},{"$f":"CDIM7SH3-0.875","v":-0.875},null,{"$f":"AJ137","v":0},null,null,null,null,{"$f":"(Frame_Width/3)-(1.75*2)","v":-3.5},{"$f":"CDIM8SH3-3.5","v":-3.5},null,null,null,null,null,null,"Top Stile Reinf",{"$f":"IF(OR(Frame_Width>48,Frame_Height>84,EXTTYPE=\"Steel\"),((TRUNC(((DDIM3A01-1.625)-8)/2)*2)/12)*2,0)","v":0},0.29899999999999999,0,null,"Top Stile Reinf",0,0,0,null,null,null,{"$error":"#N/A"},{"$error":"#N/A"},{"$f":"IF(AND(AO76=19,$AM$4>=34,$AM$4<=36.99),AO76&\"-\"&\"13\",0)","v":{"$error":"#N/A"}},null,null,{"$error":"#N/A"},{"$error":"#N/A"},{"$f":"IF(AND(AT76=19,$AR$4>=34,$AR$4<=36.99),AT76&\"-\"&\"13\",0)","v":{"$error":"#N/A"}},null,null,null,null,null,null,null,null,null,null,null,null,null,null,null,null,null,null,null,{"$error":"#N/A"},{"$error":"#N/A"},{"$f":"IF(AND(BP76=18,$BN$4>=30,$BN$4<=32),BP76&\"H\",0)","v":{"$error":"#N/A"}},null,null,{"$error":"#N/A"},{"$error":"#N/A"},{"$f":"IF(AND(BU76=18,$BS$4>=30,$BS$4<=32),BU76&\"H\",0)","v":{"$error":"#N/A"}}]
[null,7,4,1,null,null,null,null,null,null,"82SP",{"$f":"CDIM82SP","v":0.25},{"$f":"CDIM82SP-0.875","v":-0.625},null,{"$f":"AJ159","v":0},null,null,null,null,{"$f":"IF(EXTSELECT=3,(Frame_Width-_DIM4)-(1.75*2),_DIM4-(1.75*2))","v":-3.5},{"$f":"CDIM82SP-3.5","v":-3.25},null,null,null,null,null,null,"Top Glass",{"$f":"(CMR!$T$13*CMR!$T$15)/144","v":0.12852647569444445},{"$f":"$H$10","v":2.3140000000000001},0.29741026475694443,null,"Top Glass",0,0,0,null,null,null,{"$error":"#N/A"},{"$error":"#N/A"},{"$f":"IF(AND(AO77=19,$AM$4>=37,$AM$4<=39.99),AO77&\"-\"&\"14\",0)","v":{"$error":"#N/A"}},null,null,{"$f":"IF(AND(AT77>0,AU77>0),AT77,0)","v":{"$error":"#N/A"}},{"$error":"#N/A"},{"$f":"IF(AND(AT77=19,$AR$4>=37,$AR$4<=39.99),AT77&\"-\"&\"14\",0)","v":{"$error":"#N/A"}},null,null,null,null,null,null,null,null,null,null,null,null,null,null,null,null,null,null,null,{"$error":"#N/A"},{"$error":"#N/A"},{"$f":"IF(AND(BP77=18,$BN$4>=33,$BN$4<=34),BP77&\"I\",0)","v":{"$error":"#N/A"}},null,null,{"$error":"#N/A"},{"$error":"#N/A"},{"$f":"IF(AND(BU77=18,$BS$4>=33,$BS$4<=34),BU77&\"I\",0)","v":{"$error":"#N/A"}}]
[null,8,4,1,null,null,null,null,null,null,"8SPS",{"$f":"CDIM8SPS","v":0.25},{"$f":"CDIM8SPS-0.875","v":-0.625},null,{"$f":"AE159","v":0},null,null,null,null,{"$f":"_DIM4-(1.75*2)","v":-3.5},{"$f":"CDIM8SPS-3.5","v":-3.25},null,null,null,null,null,null,"Top Spacer",{"$f":"((CMR!$T$13*2)+(CMR!$T$15*2))/12","v":-1.4947916666666667},5.3600000000000002E-2,-8.0120833333333336E-2,null,"Top Spacer",0,0,0,null,null,null,{"$f":"IF(AND(AO78>0,AP78>0),AO78,0)","v":{"$error":"#N/A"}},{"$error":"#N/A"},{"$f":"IF(AND(AO78=19,$AM$4>=40,$AM$4<=42),AO78&\"-\"&\"15\",0)","v":{"$error":"#N/A"}},null,null,{"$error":"#N/A"},{"$error":"#N/A"},{"$f":"IF(AND(AT78=19,$AR$4>=40,$AR$4<=42),AT78&\"-\"&\"15\",0)","v":{"$error":"#N/A"}},null,null,null,null,null,null,null,null,null,null,null,null,null,null,null,null,null,null,null,{"$error":"#N/A"},{"$error":"#N/A"},{"$f":"IF(AND(BP78=18,$BN$4>=35,$BN$4<=36),\"Dbl.\"&BP78&\"C\",0)","v":{"$error":"#N/A"}},null,null,{"$error":"#N/A"},{"$error":"#N/A"},{"$f":"IF(AND(BU78=18,$BS$4>=35,$BS$4<=36),\"Dbl.\"&BU78&\"C\",0)","v":{"$error":"#N/A"}}]
[null,9,5,1,null,null,null,null,null,null,"8SPP",{"$f":"CDIM8SPP","v":-0.21875},{"$f":"CDIM8SPP-0.875","v":-1.09375},null,{"$f":"AE181","v":0},null,null,null,null,{"$f":"_DIM4-(1.75*2)","v":-3.5},{"$f":"CDIM8SPP-3.5","v":-3.71875},null,null,null,null,null,null,"Top Hardware",1,0.4,0.4,null,"Top Hardware",0,0,0,null,null,null,{"$error":"#N/A"},{"$f":"IF(AND($AN$4<=21,$AN$4>19),21,0)","v":{"$error":"#N/A"}},{"$f":"IF(AND(AO79=21,$AM$4>=4,$AM$4<=6.99),AO79&\"-\"&\"1\",0)","v":{"$error":"#N/A"}},null,null,{"$error":"#N/A"},{"$f":"IF(AND($AS$4<=21,$AS$4>19),21,0)","v":{"$error":"#N/A"}},{"$f":"IF(AND(AT79=21,$AR$4>=4,$AR$4<=6.99),AT79&\"-\"&\"1\",0)","v":{"$error":"#N/A"}},null,null,null,null,null,null,null,null,null,null,null,null,null,null,null,null,null,null,null,{"$error":"#N/A"},{"$error":"#N/A"},{"$f":"IF(AND(BP79=18,$BN$4>=37,$BN$4<=42),\"Dbl.\"&BP79&\"D\",0)","v":{"$error":"#N/A"}},null,null,{"$error":"#N/A"},{"$error":"#N/A"},{"$f":"IF(AND(BU79=18,$BS$4>=37,$BS$4<=42),\"Dbl.\"&BU79&\"D\",0)","v":{"$error":"#N/A"}}]
[null,10,5,1,null,null,null,null,null,null,"8POS",{"$f":"CDIM8POS","v":0.46875},{"$f":"CDIM8POS-0.875","v":-0.40625},null,{"$f":"AJ181","v":0},null,null,null,null,{"$f":"Frame_Width-(1.75*2)","v":-3.5},{"$f":"CDIM8POS-3.5","v":-3.03125},null,null,null,null,null,null,"Top Bead",{"$f":"(((Frame_Width-5.125)*2)+((DDIM3A01-4.3125)*2))/12","v":-1.5729166666666667},7.1999999999999995E-2,-0.11325,null,"Top Bead",0,0,0,null,null,null,{"$error":"#N/A"},{"$error":"#N/A"},{"$f":"IF(AND(AO80=21,$AM$4>=7,$AM$4<=9.99),AO80&\"-\"&\"2\",0)","v":{"$error":"#N/A"}},null,null,{"$error":"#N/A"},{"$error":"#N/A"},{"$f":"IF(AND(AT80=21,$AR$4>=7,$AR$4<=9.99),AT80&\"-\"&\"2\",0)","v":{"$error":"#N/A"}},null,null,null,null,null,null,null,null,null,null,null,null,null,null,null,null,null,null,null,{"$error":"#N/A"},{"$error":"#N/A"},{"$f":"IF(AND(BP80=18,$BN$4>=43,$BN$4<=48),\"Dbl.\"&BP80&\"E\",0)","v":{"$error":"#N/A"}},null,null,{"$error":"#N/A"},{"$error":"#N/A"},{"$f":"IF(AND(BU80=18,$BS$4>=43,$BS$4<=48),\"Dbl.\"&BU80&\"E\",0)","v":{"$error":"#N/A"}}]
[null,11,6,1,null,null,null,null,null,null,"8SOP",{"$f":"CDIM8SOP","v":-0.21875},{"$f":"CDIM8SOP-0.875","v":-1.09375},null,{"$f":"AJ203","v":0},null,null,null,null,{"$f":"Frame_Width-(1.75*2)","v":-3.5},{"$f":"CDIM8SOP-3.5","v":-3.71875},null,null,null,null,null,null,"Bottom Top Rail",{"$f":"(Frame_Width-3.125)/12","v":-0.26041666666666669},0.29699999999999999,-7.7343750000000003E-2,null,"Bottom Top Rail",{"$f":"(Frame_Width-3.125)/12","v":-0.26041666666666669},0.29699999999999999,{"$f":"AH81*AI81","v":-7.7343750000000003E-2},null,null,null,{"$error":"#N/A"},{"$error":"#N/A"},{"$f":"IF(AND(AO81=21,$AM$4>=10,$AM$4<=13.99),AO81&\"-\"&\"3\",0)","v":{"$error":"#N/A"}},null,null,{"$error":"#N/A"},{"$error":"#N/A"},{"$f":"IF(AND(AT81=21,$AR$4>=10,$AR$4<=13.99),AT81&\"-\"&\"3\",0)","v":{"$error":"#N/A"}},null,null,null,null,null,null,null,null,null,null,null,null,null,null,null,null,null,null,null,{"$error":"#N/A"},{"$error":"#N/A"},{"$f":"IF(AND(BP81=18,$BN$4>=49,$BN$4<=52),\"Dbl.\"&BP81&\"F\",0)","v":{"$error":"#N/A"}},null,null,{"$error":"#N/A"},{"$error":"#N/A"},{"$f":"IF(AND(BU81=18,$BS$4>=49,$BS$4<=52),\"Dbl.\"&BU81&\"F\",0)","v":{"$error":"#N/A"}}]
[null,12,6,1,null,null,null,null,null,null,"8PS3",{"$f":"CDIM8PS3","v":0.46875},{"$f":"CDIM8PS3-0.875","v":-0.40625},{"$f":"CDIM8PS3-0.875","v":-0.40625},{"$f":"AE203","v":0},{"$f":"AE202","v":0},null,null,null,{"$f":"IF(_DIM4=(W/2),(Frame_Width/2)-(1.75*2),IF(_DIM4<(W/2),(Frame_Width-_DIM4)-(1.75*2),IF(_DIM4>(W/2),_DIM4-(1.75*2),0)))","v":-3.5},{"$f":"CDIM8PS3-3.5","v":-3.03125},null,null,null,null,null,null,"Bottom Bottom Rail",{"$f":"(Frame_Width-3.125)/12","v":-0.26041666666666669},0.23200000000000001,-6.0416666666666674E-2,null,"Bottom Bottom Rail",{"$f":"(Frame_Width-3.125)/12","v":-0.26041666666666669},0.23200000000000001,-6.0416666666666674E-2,null,null,null,{"$error":"#N/A"},{"$error":"#N/A"},{"$f":"IF(AND(AO82=21,$AM$4>=14,$AM$4<=18.99),AO82&\"-\"&\"4\",0)","v":{"$error":"#N/A"}},null,null,{"$error":"#N/A"},{"$error":"#N/A"},{"$f":"IF(AND(AT82=21,$AR$4>=14,$AR$4<=18.99),AT82&\"-\"&\"4\",0)","v":{"$error":"#N/A"}},"x",null,null,null,null,null,null,null,null,null,null,null,null,null,null,null,null,null,null,{"$error":"#N/A"},{"$error":"#N/A"},{"$f":"IF(AND(BP82=18,$BN$4>=53,$BN$4<=58),\"Dbl.\"&BP82&\"G\",0)","v":{"$error":"#N/A"}},null,null,{"$error":"#N/A"},{"$error":"#N/A"},{"$f":"IF(AND(BU82=18,$BS$4>=53,$BS$4<=58),\"Dbl.\"&BU82&\"G\",0)","v":{"$error":"#N/A"}}]
[null,13,7,1,null,null,null,null,null,null,"8SP3",{"$f":"CDIM8SP3","v":-0.21875},{"$f":"CDIM8SP3-0.875","v":-1.09375},{"$f":"CDIM8SP3-0.875","v":-1.09375},{"$f":"AE225","v":0},{"$f":"AE224","v":0},null,null,null,{"$f":"IF(_DIM4=(W/2),(Frame_Width/2)-(1.75*2),IF(_DIM4>(W/2),(Frame_Width-_DIM4)-(1.75*2),IF(_DIM4<(W/2),_DIM4-(1.75*2),0)))","v":-3.5},{"$f":"CDIM8SP3-3.5","v":-3.71875},null,null,null,null,null,null,"Bottom Stile",{"$f":"(2*(CDIM3A01-0.625))/12","v":-0.10416666666666667},0.219,-2.2812499999999999E-2,null,"Bottom Stile",{"$f":"((CDIM03S0-1.125)*2)/12","v":-0.1875},0.219,-4.1062500000000002E-2,null,null,null,{"$error":"#N/A"},{"$error":"#N/A"},{"$f":"IF(AND(AO83=21,$AM$4>=19,$AM$4<=23.99),AO83&\"-\"&\"5\",0)","v":{"$error":"#N/A"}},null,null,{"$error":"#N/A"},{"$error":"#N/A"},{"$f":"IF(AND(AT83=21,$AR$4>=19,$AR$4<=23.99),AT83&\"-\"&\"5\",0)","v":{"$error":"#N/A"}},null,null,null,null,null,null,null,null,null,null,null,null,null,null,null,null,null,null,null,{"$error":"#N/A"},{"$error":"#N/A"},{"$f":"IF(AND(BP83=18,$BN$4>=59,$BN$4<=64),\"Dbl.\"&BP83&\"H\",0)","v":{"$error":"#N/A"}},null,null,{"$error":"#N/A"},{"$error":"#N/A"},{"$f":"IF(AND(BU83=18,$BS$4>=59,$BS$4<=64),\"Dbl.\"&BU83&\"H\",0)","v":{"$error":"#N/A"}}]
[null,14,7,1,null,null,null,null,null,null,null,null,null,null,null,null,null,null,null,null,null,null,null,null,null,null,null,"Bottom Rail Reinf.",{"$f":"(TRUNC(((Frame_Width-3.125)-6)/2)*2)/12","v":-0.66666666666666663},{"$f":"IF(OR(EXTSELECT=2,Frame_Width<48,Frame_Height<84),0.0516,IF(OR(EXTSELECT=3,Frame_Width>48,Frame_Height>84),0.57,0))","v":5.16E-2},-3.44E-2,null,"Bottom Rail Reinf.",{"$f":"(TRUNC(((Frame_Width-3.125)-6)/2)*2)/12","v":-0.66666666666666663},{"$f":"IF(OR(EXTSELECT=2,Frame_Width<48,Frame_Height<84),0.0516,IF(OR(EXTSELECT=3,Frame_Width>48,Frame_Height>84),0.57,0))","v":5.16E-2},-3.44E-2,null,null,null,{"$error":"#N/A"},{"$error":"#N/A"},{"$f":"IF(AND(AO84=21,$AM$4>=24,$AM$4<=26.99),AO84&\"-\"&\"6\",0)","v":{"$error":"#N/A"}},null,null,{"$error":"#N/A"},{"$error":"#N/A"},{"$f":"IF(AND(AT84=21,$AR$4>=24,$AR$4<=26.99),AT84&\"-\"&\"6\",0)","v":{"$error":"#N/A"}},null,null,null,null,null,null,null,null,null,null,null,null,null,null,null,null,null,null,null,{"$error":"#N/A"},{"$error":"#N/A"},{"$f":"IF(AND(BP84=18,$BN$4>=65,$BN$4<=68),\"Dbl.\"&BP84&\"I\",0)","v":{"$error":"#N/A"}},null,null,{"$error":"#N/A"},{"$error":"#N/A"},{"$f":"IF(AND(BU84=18,$BS$4>=65,$BS$4<=68),\"Dbl.\"&BU84&\"I\",0)","v":{"$error":"#N/A"}}]
[null,15,8,1,null,null,null,null,null,null,null,null,null,null,null,null,null,null,null,null,null,null,null,null,null,null,null,"Bottom Stile Reinf.",{"$f":"IF(OR(Frame_Width>48,Frame_Height>84,EXTTYPE=\"Steel\"),((TRUNC((CDIM3A01-2)/2)*2)/12)*2,0)","v":0},0.45600000000000002,0,null,"Bottom Stile Reinf.",{"$f":"IF(OR(Frame_Width>48,Frame_Height>84,EXTTYPE=\"Steel\"),((TRUNC(((CDIM03S0-1.125)-4)/2)*2)/12)*2,0)","v":0},0.45600000000000002,0,null,null,null,{"$error":"#N/A"},{"$error":"#N/A"},{"$f":"IF(AND(AO85=21,$AM$4>=27,$AM$4<=29.99),AO85&\"-\"&\"9\",0)","v":{"$error":"#N/A"}},null,null,{"$error":"#N/A"},{"$error":"#N/A"},{"$f":"IF(AND(AT85=21,$AR$4>=27,$AR$4<=29.99),AT85&\"-\"&\"9\",0)","v":{"$error":"#N/A"}},null,null,null,null,null,null,null,null,null,null,null,null,null,null,null,null,null,null,null,{"$error":"#N/A"},{"$f":"IF(AND($BO$4<=20,$BO$4>18),20,0)","v":{"$error":"#N/A"}},{"$f":"IF(AND(BP85=20,$BN$4>=5,$BN$4<=10),BP85&\"A\",0)","v":{"$error":"#N/A"}},null,null,{"$error":"#N/A"},{"$f":"IF(AND($BT$4<=20,$BT$4>18),20,0)","v":{"$error":"#N/A"}},{"$f":"IF(AND(BU85=20,$BS$4>=5,$BS$4<=10),BU85&\"A\",0)","v":{"$error":"#N/A"}}]
[null,16,8,1,null,null,null,null,null,null,null,null,null,null,null,null,null,null,null,null,null,null,null,null,null,null,null,"Bottom Glass",{"$f":"(CMR!$T$14*CMR!$T$16)/144","v":7.3187934027777776E-2},{"$f":"$H$10","v":2.3140000000000001},0.16935687934027777,null,"Bottom Glass",{"$f":"(CMR!$T$30*CMR!$T$32)/144","v":8.9680989583333329E-2},{"$f":"$H$10","v":2.3140000000000001},0.20752180989583333,null,null,null,{"$error":"#N/A"},{"$error":"#N/A"},{"$f":"IF(AND(AO86=21,$AM$4>=30,$AM$4<=30.99),AO86&\"-\"&\"11\",0)","v":{"$error":"#N/A"}},null,null,{"$error":"#N/A"},{"$error":"#N/A"},{"$f":"IF(AND(AT86=21,$AR$4>=30,$AR$4<=30.99),AT86&\"-\"&\"11\",0)","v":{"$error":"#N/A"}},null,null,null,null,null,null,null,null,null,null,null,null,null,null,null,null,null,null,null,{"$error":"#N/A"},{"$error":"#N/A"},{"$f":"IF(AND(BP86=20,$BN$4>=11,$BN$4<=14),BP86&\"B\",0)","v":{"$error":"#N/A"}},null,null,{"$error":"#N/A"},{"$error":"#N/A"},{"$f":"IF(AND(BU86=20,$BS$4>=11,$BS$4<=14),BU86&\"B\",0)","v":{"$error":"#N/A"}}]
[null,17,9,1,null,null,null,null,null,null,null,null,null,null,null,null,null,null,null,null,null,null,null,null,null,null,null,"Bottom Spacer",{"$f":"((CMR!$T$14*2)+(CMR!$T$16*2))/12","v":-1.1614583333333333},5.3600000000000002E-2,-6.2254166666666666E-2,null,"Bottom Spacer",{"$f":"((CMR!$T$30*2)+(CMR!$T$32*2))/12","v":-1.2447916666666667},5.3600000000000002E-2,{"$f":"AH87*AI87","v":-6.672083333333334E-2},null,null,null,{"$error":"#N/A"},{"$error":"#N/A"},{"$f":"IF(AND(AO87=21,$AM$4>=31,$AM$4<=33.99),AO87&\"-\"&\"12\",0)","v":{"$error":"#N/A"}},null,null,{"$error":"#N/A"},{"$error":"#N/A"},{"$f":"IF(AND(AT87=21,$AR$4>=31,$AR$4<=33.99),AT87&\"-\"&\"12\",0)","v":{"$error":"#N/A"}},null,null,null,null,null,null,null,null,null,null,null,null,null,null,null,null,null,null,null,{"$error":"#N/A"},{"$error":"#N/A"},{"$f":"IF(AND(BP87=20,$BN$4>=15,$BN$4<=18),BP87&\"C\",0)","v":{"$error":"#N/A"}},null,null,{"$error":"#N/A"},{"$error":"#N/A"},{"$f":"IF(AND(BU87=20,$BS$4>=15,$BS$4<=18),BU87&\"C\",0)","v":{"$error":"#N/A"}}]
[null,18,9,1,null,null,null,null,null,null,null,null,null,null,null,null,null,null,null,null,null,null,null,null,null,null,null,"Bottom Hardware",1,0.36,0.36,null,"Bottom Hardware",1,0.36,{"$f":"AH88*AI88","v":0.36},null,null,null,{"$error":"#N/A"},{"$error":"#N/A"},{"$f":"IF(AND(AO88=21,$AM$4>=34,$AM$4<=36.99),AO88&\"-\"&\"13\",0)","v":{"$error":"#N/A"}},null,null,{"$error":"#N/A"},{"$error":"#N/A"},{"$f":"IF(AND(AT88=21,$AR$4>=34,$AR$4<=36.99),AT88&\"-\"&\"13\",0)","v":{"$error":"#N/A"}},null,null,null,null,null,null,null,null,null,null,null,null,null,null,null,null,null,null,null,{"$error":"#N/A"},{"$error":"#N/A"},{"$f":"IF(AND(BP88=20,$BN$4>=19,$BN$4<=22),BP88&\"D\",0)","v":{"$error":"#N/A"}},null,null,{"$error":"#N/A"},{"$error":"#N/A"},{"$f":"IF(AND(BU88=20,$BS$4>=19,$BS$4<=22),BU88&\"D\",0)","v":{"$error":"#N/A"}}]
[null,19,10,1,null,null,null,null,null,null,null,null,null,null,null,null,null,null,null,null,null,null,null,null,null,null,null,"Bottom Bead",{"$f":"(((Frame_Width-4.125)*2)+((CDIM3A01-3.3125)*2))/12","v":-1.2395833333333333},7.1999999999999995E-2,-8.9249999999999982E-2,null,"Bottom Bead",{"$f":"(((Frame_Width-4.125)*2)+((CDIM03S0-3.3125)*2))/12","v":-1.2395833333333333},7.1999999999999995E-2,{"$f":"AH89*AI89","v":-8.9249999999999982E-2},null,null,null,{"$error":"#N/A"},{"$error":"#N/A"},{"$f":"IF(AND(AO89=21,$AM$4>=37,$AM$4<=39.99),AO89&\"-\"&\"14\",0)","v":{"$error":"#N/A"}},null,null,{"$error":"#N/A"},{"$error":"#N/A"},{"$f":"IF(AND(AT89=21,$AR$4>=37,$AR$4<=39.99),AT89&\"-\"&\"14\",0)","v":{"$error":"#N/A"}},null,null,null,null,null,null,null,null,null,null,null,null,null,null,null,null,null,null,null,{"$error":"#N/A"},{"$error":"#N/A"},{"$f":"IF(AND(BP89=20,$BN$4>=23,$BN$4<=26),BP89&\"E\",0)","v":{"$error":"#N/A"}},null,null,{"$error":"#N/A"},{"$error":"#N/A"},{"$f":"IF(AND(BU89=20,$BS$4>=23,$BS$4<=26),BU89&\"E\",0)","v":{"$error":"#N/A"}}]
[null,20,10,1,null,null,null,null,null,null,null,null,null,null,null,null,null,null,null,null,null,null,null,null,null,null,null,null,null,"Top Sash",{"$f":"IF(ModelNo=\"3A01\",(TRUNC((SUM(AE72:AE80))))+5,0)","v":0},null,null,null,"Top Sash",0,null,null,null,{"$f":"IF(AND(AO90>0,AP90>0),AO90,0)","v":{"$error":"#N/A"}},{"$error":"#N/A"},{"$f":"IF(AND(AO90=21,$AM$4>=40,$AM$4<=42),AO90&\"-\"&\"15\",0)","v":{"$error":"#N/A"}},null,null,{"$error":"#N/A"},{"$error":"#N/A"},{"$f":"IF(AND(AT90=21,$AR$4>=40,$AR$4<=42),AT90&\"-\"&\"15\",0)","v":{"$error":"#N/A"}},null,null,null,null,null,null,null,null,null,null,null,null,null,null,null,null,null,null,null,{"$error":"#N/A"},{"$error":"#N/A"},{"$f":"IF(AND(BP90=20,$BN$4>=27,$BN$4<=30),BP90&\"F\",0)","v":{"$error":"#N/A"}},null,null,{"$error":"#N/A"},{"$error":"#N/A"},{"$f":"IF(AND(BU90=20,$BS$4>=27,$BS$4<=30),BU90&\"F\",0)","v":{"$error":"#N/A"}}]
[null,21,56,2,null,null,null,null,null,null,null,null,null,null,null,null,null,null,null,null,null,null,null,null,null,null,null,null,null,"Bottom Sash",{"$f":"IF(ModelNo=\"3A01\",TRUNC((SUM(AE81:AE89))),0)","v":0},null,null,null,"Bottom Sash",{"$f":"IF(OR(ModelNo=\"03S0\",ModelNo=\"A140\",ModelNo=\"A144\",ModelNo=\"A146\"),TRUNC(SUM(AJ81:AJ89)),0)","v":0},null,null,null,{"$error":"#N/A"},{"$f":"IF(AND($AN$4<=23,$AN$4>21),23,0)","v":{"$error":"#N/A"}},{"$f":"IF(AND(AO91=23,$AM$4>=5,$AM$4<=7.99),AO91&\"-\"&\"1\",0)","v":{"$error":"#N/A"}},null,null,{"$error":"#N/A"},{"$f":"IF(AND($AS$4<=23,$AS$4>21),23,0)","v":{"$error":"#N/A"}},{"$f":"IF(AND(AT91=23,$AR$4>=5,$AR$4<=7.99),AT91&\"-\"&\"1\",0)","v":{"$error":"#N/A"}},null,null,null,null,null,null,null,null,null,null,null,null,null,null,null,null,null,null,null,{"$error":"#N/A"},{"$error":"#N/A"},{"$f":"IF(AND(BP91=20,$BN$4>=31,$BN$4<=34),BP91&\"G\",0)","v":{"$error":"#N/A"}},null,null,{"$error":"#N/A"},{"$error":"#N/A"},{"$f":"IF(AND(BU91=20,$BS$4>=31,$BS$4<=34),BU91&\"G\",0)","v":{"$error":"#N/A"}}]
[null,22,56,2,null,null,null,null,null,null,null,null,null,null,null,null,null,null,null,null,null,null,null,null,null,null,null,null,null,null,null,null,null,null,null,null,null,null,null,{"$error":"#N/A"},{"$error":"#N/A"},{"$f":"IF(AND(AO92=23,$AM$4>=8,$AM$4<=10.99),AO92&\"-\"&\"2\",0)","v":{"$error":"#N/A"}},null,null,{"$error":"#N/A"},{"$error":"#N/A"},{"$f":"IF(AND(AT92=23,$AR$4>=8,$AR$4<=10.99),AT92&\"-\"&\"2\",0)","v":{"$error":"#N/A"}},null,null,null,null,null,null,null,null,null,null,null,null,null,null,null,null,null,null,null,{"$error":"#N/A"},{"$error":"#N/A"},{"$f":"IF(AND(BP92=20,$BN$4>=35,$BN$4<=37),BP92&\"H\",0)","v":{"$error":"#N/A"}},null,null,{"$error":"#N/A"},{"$error":"#N/A"},{"$f":"IF(AND(BU92=20,$BS$4>=35,$BS$4<=37),BU92&\"H\",0)","v":{"$error":"#N/A"}}]
[null,23,66,2,null,null,null,null,null,null,null,null,null,null,null,null,null,null,null,null,null,null,null,null,null,null,null,null,null,null,null,null,null,null,null,null,null,null,null,{"$error":"#N/A"},{"$error":"#N/A"},{"$f":"IF(AND(AO93=23,$AM$4>=11,$AM$4<=14.99),AO93&\"-\"&\"3\",0)","v":{"$error":"#N/A"}},null,null,{"$error":"#N/A"},{"$error":"#N/A"},{"$f":"IF(AND(AT93=23,$AR$4>=11,$AR$4<=14.99),AT93&\"-\"&\"3\",0)","v":{"$error":"#N/A"}},null,null,null,null,null,null,null,null,null,null,null,null,null,null,null,null,null,null,null,{"$error":"#N/A"},{"$error":"#N/A"},{"$f":"IF(AND(BP93=20,$BN$4>=38,$BN$4<=40),BP93&\"I\",0)","v":{"$error":"#N/A"}},null,null,{"$error":"#N/A"},{"$error":"#N/A"},{"$f":"IF(AND(BU93=20,$BS$4>=38,$BS$4<=40),BU93&\"I\",0)","v":{"$error":"#N/A"}}]
[null,24,66,2,null,null,null,null,null,null,null,null,null,null,null,null,null,null,null,null,null,null,null,null,null,null,null,null,null,null,null,null,null,null,null,null,null,null,null,{"$error":"#N/A"},{"$error":"#N/A"},{"$f":"IF(AND(AO94=23,$AM$4>=15,$AM$4<=18.99),AO94&\"-\"&\"4\",0)","v":{"$error":"#N/A"}},null,null,{"$error":"#N/A"},{"$error":"#N/A"},{"$f":"IF(AND(AT94=23,$AR$4>=15,$AR$4<=18.99),AT94&\"-\"&\"4\",0)","v":{"$error":"#N/A"}},"x",null,null,null,null,null,null,null,null,null,null,null,null,null,null,null,null,null,null,{"$error":"#N/A"},{"$error":"#N/A"},{"$f":"IF(AND(BP94=20,$BN$4>=41,$BN$4<=44),\"Dbl.\"&BP94&\"D\",0)","v":{"$error":"#N/A"}},null,null,{"$error":"#N/A"},{"$error":"#N/A"},{"$f":"IF(AND(BU94=20,$BS$4>=41,$BS$4<=44),\"Dbl.\"&BU94&\"D\",0)","v":{"$error":"#N/A"}}]
[null,25,67,2,null,null,null,null,null,null,null,null,null,null,null,null,null,null,null,null,null,null,null,null,null,null,null,"7SH2","Length","Weight/ft","Weight",null,"8SH2","Length","Weight/ft","Weight",null,null,null,{"$error":"#N/A"},{"$error":"#N/A"},{"$f":"IF(AND(AO95=23,$AM$4>=19,$AM$4<=23.99),AO95&\"-\"&\"5\",0)","v":{"$error":"#N/A"}},null,null,{"$error":"#N/A"},{"$error":"#N/A"},{"$f":"IF(AND(AT95=23,$AR$4>=19,$AR$4<=23.99),AT95&\"-\"&\"5\",0)","v":{"$error":"#N/A"}},null,null,null,null,null,null,null,null,null,null,null,null,null,null,null,null,null,null,null,{"$error":"#N/A"},{"$error":"#N/A"},{"$f":"IF(AND(BP95=20,$BN$4>=45,$BN$4<=52),\"Dbl.\"&BP95&\"E\",0)","v":{"$error":"#N/A"}},null,null,{"$error":"#N/A"},{"$error":"#N/A"},{"$f":"IF(AND(BU95=20,$BS$4>=45,$BS$4<=52),\"Dbl.\"&BU95&\"E\",0)","v":{"$error":"#N/A"}}]
[null,26,67,2,null,null,null,null,null,null,null,null,null,null,null,null,null,null,null,null,null,null,null,null,null,null,null,"Top Top Rail",0,0,{"$f":"AC96*AD96","v":0},null,"Top Top Rail",0,0,{"$f":"AH96*AI96","v":0},null,null,null,{"$error":"#N/A"},{"$error":"#N/A"},{"$f":"IF(AND(AO96=23,$AM$4>=24,$AM$4<=28.99),AO96&\"-\"&\"6\",0)","v":{"$error":"#N/A"}},null,null,{"$error":"#N/A"},{"$error":"#N/A"},{"$f":"IF(AND(AT96=23,$AR$4>=24,$AR$4<=28.99),AT96&\"-\"&\"6\",0)","v":{"$error":"#N/A"}},null,null,null,null,null,null,null,null,null,null,null,null,null,null,null,null,null,null,null,{"$error":"#N/A"},{"$error":"#N/A"},{"$f":"IF(AND(BP96=20,$BN$4>=53,$BN$4<=60),\"Dbl.\"&BP96&\"F\",0)","v":{"$error":"#N/A"}},null,null,{"$error":"#N/A"},{"$error":"#N/A"},{"$f":"IF(AND(BU96=20,$BS$4>=53,$BS$4<=60),\"Dbl.\"&BU96&\"F\",0)","v":{"$error":"#N/A"}}]
[null,27,77,2,null,null,null,null,null,null,null,null,null,null,null,null,null,null,null,null,null,null,null,null,null,null,null,"Top Bottom Rail",0,0,{"$f":"AC97*AD97","v":0},null,"Top Bottom Rail",0,0,{"$f":"AH97*AI97","v":0},null,null,null,{"$error":"#N/A"},{"$error":"#N/A"},{"$f":"IF(AND(AO97=23,$AM$4>=29,$AM$4<=31.99),AO97&\"-\"&\"9\",0)","v":{"$error":"#N/A"}},null,null,{"$error":"#N/A"},{"$error":"#N/A"},{"$f":"IF(AND(AT97=23,$AR$4>=29,$AR$4<=31.99),AT97&\"-\"&\"9\",0)","v":{"$error":"#N/A"}},null,null,null,null,null,null,null,null,null,null,null,null,null,null,null,null,null,null,null,{"$error":"#N/A"},{"$error":"#N/A"},{"$f":"IF(AND(BP97=20,$BN$4>=61,$BN$4<=68),\"Dbl.\"&BP97&\"G\",0)","v":{"$error":"#N/A"}},null,null,{"$error":"#N/A"},{"$error":"#N/A"},{"$f":"IF(AND(BU97=20,$BS$4>=61,$BS$4<=68),\"Dbl.\"&BU97&\"G\",0)","v":{"$error":"#N/A"}}]
[null,28,77,2,null,null,null,null,null,null,null,false,"AC SASH CALCULATOR",null,null,null,null,null,null,null,null,null,null,null,null,null,null,"Top Stile",0,0,{"$f":"(AC98*AD98)/12","v":0},null,"Top Stile",0,0,{"$f":"(AH98*AI98)/12","v":0},null,null,null,{"$error":"#N/A"},{"$error":"#N/A"},{"$f":"IF(AND(AO98=23,$AM$4>=32,$AM$4<=33.99),AO98&\"-\"&\"12\",0)","v":{"$error":"#N/A"}},null,null,{"$error":"#N/A"},{"$error":"#N/A"},{"$f":"IF(AND(AT98=23,$AR$4>=32,$AR$4<=33.99),AT98&\"-\"&\"12\",0)","v":{"$error":"#N/A"}},null,null,null,null,null,null,null,null,null,null,null,null,null,null,null,null,null,null,null,{"$error":"#N/A"},{"$error":"#N/A"},{"$f":"IF(AND(BP98=20,$BN$4>=69,$BN$4<=74),\"Dbl.\"&BP98&\"H\",0)","v":{"$error":"#N/A"}},null,null,{"$error":"#N/A"},{"$error":"#N/A"},{"$f":"IF(AND(BU98=20,$BS$4>=69,$BS$4<=74),\"Dbl.\"&BU98&\"H\",0)","v":{"$error":"#N/A"}}]
[null,29,78,2,null,null,null,null,null,null,null,"Model","Head","Sill","Center of Astragal","Sash Width","Sash Height","CMR",null,null,null,null,null,null,null,null,null,"Top Rail Reinf.",0,0,0,null,"Top Rail Reinf.",0,0,0,null,null,null,{"$error":"#N/A"},{"$error":"#N/A"},{"$f":"IF(AND(AO99=23,$AM$4>=34,$AM$4<=36.99),AO99&\"-\"&\"13\",0)","v":{"$error":"#N/A"}},null,null,{"$error":"#N/A"},{"$error":"#N/A"},{"$f":"IF(AND(AT99=23,$AR$4>=34,$AR$4<=36.99),AT99&\"-\"&\"13\",0)","v":{"$error":"#N/A"}},null,null,null,null,null,null,null,null,null,null,null,null,null,null,null,null,null,null,null,{"$error":"#N/A"},{"$error":"#N/A"},{"$f":"IF(AND(BP99=20,$BN$4>=75,$BN$4<=80),\"Dbl.\"&BP99&\"I\",0)","v":{"$error":"#N/A"}},null,null,{"$error":"#N/A"},{"$error":"#N/A"},{"$f":"IF(AND(BU99=20,$BS$4>=75,$BS$4<=80),\"Dbl.\"&BU99&\"I\",0)","v":{"$error":"#N/A"}}]
[null,30,78,2,null,null,null,null,null,null,null,{"$f":"ModelNo","v":"Select Model"},{"$f":"IF(ISERROR(VLOOKUP(ModelNo,ACTABLE,2,FALSE)),\"\",VLOOKUP(ModelNo,ACTABLE,2,FALSE))","v":""},{"$f":"IF(ISERROR(VLOOKUP(ModelNo,ACTABLE,3,FALSE)),\"\",VLOOKUP(ModelNo,ACTABLE,3,FALSE))","v":""},{"$f":"IF(ISERROR(VLOOKUP(ModelNo,ACTABLE,4,FALSE)),\"\",VLOOKUP(ModelNo,ACTABLE,4,FALSE))","v":""},{"$f":"IF(ISERROR(VLOOKUP(ModelNo,ACTABLE,5,FALSE)),\"\",VLOOKUP(ModelNo,ACTABLE,5,FALSE))","v":""},{"$f":"IF(ISERROR(VLOOKUP(ModelNo,ACTABLE,6,FALSE)),\"\",VLOOKUP(ModelNo,ACTABLE,6,FALSE))","v":""},{"$f":"IF(ISERROR(VLOOKUP(ModelNo,ACTABLE,7,FALSE)),\"\",VLOOKUP(ModelNo,ACTABLE,7,FALSE))","v":""},null,null,null,null,null,null,null,null,null,"Top Stile Reinf",0,0,0,null,"Top Stile Reinf",0,0,0,null,null,null,{"$error":"#N/A"},{"$error":"#N/A"},{"$f":"IF(AND(AO100=23,$AM$4>=37,$AM$4<=39.99),AO100&\"-\"&\"14\",0)","v":{"$error":"#N/A"}},null,null,{"$error":"#N/A"},{"$error":"#N/A"},{"$f":"IF(AND(AT100=23,$AR$4>=37,$AR$4<=39.99),AT100&\"-\"&\"14\",0)","v":{"$error":"#N/A"}},null,null,null,null,null,null,null,null,null,null,null,null,null,null,null,null,null,null,null,{"$error":"#N/A"},{"$f":"IF(AND($BO$4<=22,$BO$4>20),22,0)","v":{"$error":"#N/A"}},{"$f":"IF(AND(BP100=22,$BN$4>=5,$BN$4<=10),BP100&\"A\",0)","v":{"$error":"#N/A"}},null,null,{"$error":"#N/A"},{"$f":"IF(AND($BT$4<=22,$BT$4>20),22,0)","v":{"$error":"#N/A"}},{"$f":"IF(AND(BU100=22,$BS$4>=5,$BS$4<=10),BU100&\"A\",0)","v":{"$error":"#N/A"}}]
[null,31,88,2,null,null,null,null,null,null,null,"A201",1.718,1.75,null,{"$f":"Frame_Width-3.25","v":-3.25},{"$f":"INT((Frame_Height-(M101+N101+0.5+ACHEIGHT))*16+0.5)/16","v":-3.9375},null,null,null,null,null,null,null,null,null,null,"Top Glass",0,0,0,null,"Top Glass",0,0,0,null,null,null,{"$error":"#N/A"},{"$error":"#N/A"},{"$f":"IF(AND(AO101=23,$AM$4>=40,$AM$4<=43),AO101&\"-\"&\"15\",0)","v":{"$error":"#N/A"}},null,null,{"$error":"#N/A"},{"$error":"#N/A"},{"$f":"IF(AND(AT101=23,$AR$4>=40,$AR$4<=43),AT101&\"-\"&\"15\",0)","v":{"$error":"#N/A"}},null,null,null,null,null,null,null,null,null,null,null,null,null,null,null,null,null,null,null,{"$error":"#N/A"},{"$error":"#N/A"},{"$f":"IF(AND(BP101=22,$BN$4>=11,$BN$4<=16),BP101&\"B\",0)","v":{"$error":"#N/A"}},null,null,{"$error":"#N/A"},{"$error":"#N/A"},{"$f":"IF(AND(BU101=22,$BS$4>=11,$BS$4<=16),BU101&\"B\",0)","v":{"$error":"#N/A"}}]
[null,32,88,2,null,null,null,null,null,null,null,"3A01",2.0625,1.875,null,{"$f":"Frame_Width-4.125","v":-4.125},{"$f":"INT((Frame_Height-(M102+N102+0.5+ACHEIGHT))*16+0.5)/16","v":-4.4375},null,null,null,null,null,null,null,null,null,null,"Top Spacer",0,0,0,null,"Top Spacer",0,0,0,null,null,null,{"$f":"IF(AND(AO102>0,AP102>0),AO102,0)","v":{"$error":"#N/A"}},{"$f":"IF(AND($AN$4<=25,$AN$4>23),25,0)","v":{"$error":"#N/A"}},{"$f":"IF(AND(AO102=25,$AM$4>=5,$AM$4<=7.99),AO102&\"-\"&\"1\",0)","v":{"$error":"#N/A"}},null,null,{"$error":"#N/A"},{"$f":"IF(AND($AS$4<=25,$AS$4>23),25,0)","v":{"$error":"#N/A"}},{"$f":"IF(AND(AT102=25,$AR$4>=5,$AR$4<=7.99),AT102&\"-\"&\"1\",0)","v":{"$error":"#N/A"}},null,null,null,null,null,null,null,null,null,null,null,null,null,null,null,null,null,null,null,{"$error":"#N/A"},{"$error":"#N/A"},{"$f":"IF(AND(BP102=22,$BN$4>=17,$BN$4<=21),BP102&\"C\",0)","v":{"$error":"#N/A"}},null,null,{"$error":"#N/A"},{"$error":"#N/A"},{"$f":"IF(AND(BU102=22,$BS$4>=17,$BS$4<=21),BU102&\"C\",0)","v":{"$error":"#N/A"}}]
[null,33,89,2,null,null,null,null,null,null,null,"03S0",null,1.875,1.25,{"$f":"Frame_Width-3.125","v":-3.125},null,{"$f":"Frame_Height-(INT((Frame_Height-(N103+0.5+ACHEIGHT+O103))*16+0.5)/16)","v":3.625},null,null,null,null,null,null,null,null,null,"Top Hardware",0,0,0,null,"Top Hardware",0,0,0,null,null,null,{"$error":"#N/A"},{"$error":"#N/A"},{"$f":"IF(AND(AO103=25,$AM$4>=8,$AM$4<=10.99),AO103&\"-\"&\"2\",0)","v":{"$error":"#N/A"}},null,null,{"$error":"#N/A"},{"$error":"#N/A"},{"$f":"IF(AND(AT103=25,$AR$4>=8,$AR$4<=10.99),AT103&\"-\"&\"2\",0)","v":{"$error":"#N/A"}},null,null,null,null,null,null,null,null,null,null,null,null,null,null,null,null,null,null,null,{"$error":"#N/A"},{"$error":"#N/A"},{"$f":"IF(AND(BP103=22,$BN$4>=22,$BN$4<=24),BP103&\"D\",0)","v":{"$error":"#N/A"}},null,null,{"$error":"#N/A"},{"$error":"#N/A"},{"$f":"IF(AND(BU103=22,$BS$4>=22,$BS$4<=24),BU103&\"D\",0)","v":{"$error":"#N/A"}}]
[null,34,89,2,null,null,null,null,null,null,null,"A571",1.625,1.625,null,{"$f":"Frame_Width-2.125","v":-2.125},null,{"$f":"Frame_Height-(INT((Frame_Height-(N104+0.5+ACHEIGHT+O104))*16+0.5)/16)","v":2.125},null,null,null,null,null,null,null,null,null,"Top Bead",0,0,0,null,"Top Bead",0,0,0,null,null,null,{"$error":"#N/A"},{"$error":"#N/A"},{"$f":"IF(AND(AO104=25,$AM$4>=11,$AM$4<=14.99),AO104&\"-\"&\"3\",0)","v":{"$error":"#N/A"}},null,null,{"$error":"#N/A"},{"$error":"#N/A"},{"$f":"IF(AND(AT104=25,$AR$4>=11,$AR$4<=14.99),AT104&\"-\"&\"3\",0)","v":{"$error":"#N/A"}},null,null,null,null,null,null,null,null,null,null,null,null,null,null,null,null,null,null,null,{"$error":"#N/A"},{"$error":"#N/A"},{"$f":"IF(AND(BP104=22,$BN$4>=25,$BN$4<=27),BP104&\"E\",0)","v":{"$error":"#N/A"}},null,null,{"$error":"#N/A"},{"$error":"#N/A"},{"$f":"IF(AND(BU104=22,$BS$4>=25,$BS$4<=27),BU104&\"E\",0)","v":{"$error":"#N/A"}}]
[null,35,99,2,null,null,null,null,null,null,null,"A581",1.75,1.75,0.3125,{"$f":"Frame_Width-2.8125","v":-2.8125},null,{"$f":"Frame_Height-(INT((Frame_Height-(N105+0.5+ACHEIGHT+O105))*16+0.5)/16)","v":2.5625},null,null,null,null,null,null,null,null,null,"Bottom Top Rail",{"$f":"(TRUNC((Frame_Width/2+0.25-2.0625)*32+0.5)/32)/12","v":-0.1484375},0.24299999999999999,{"$f":"AC105*AD105","v":-3.60703125E-2},null,"Bottom Top Rail",{"$f":"(TRUNC((Frame_Width/2-2.3125)*32+0.5)/32)/12","v":-0.19010416666666666},0.24299999999999999,{"$f":"AH105*AI105","v":-4.6195312499999995E-2},null,null,null,{"$error":"#N/A"},{"$error":"#N/A"},{"$f":"IF(AND(AO105=25,$AM$4>=15,$AM$4<=18.99),AO105&\"-\"&\"4\",0)","v":{"$error":"#N/A"}},null,null,{"$error":"#N/A"},{"$error":"#N/A"},{"$f":"IF(AND(AT105=25,$AR$4>=15,$AR$4<=18.99),AT105&\"-\"&\"4\",0)","v":{"$error":"#N/A"}},null,null,null,null,null,null,null,null,null,null,null,null,null,null,null,null,null,null,null,{"$error":"#N/A"},{"$error":"#N/A"},{"$f":"IF(AND(BP105=22,$BN$4>=28,$BN$4<=30),BP105&\"F\",0)","v":{"$error":"#N/A"}},null,null,{"$error":"#N/A"},{"$error":"#N/A"},{"$f":"IF(AND(BU105=22,$BS$4>=28,$BS$4<=30),BU105&\"F\",0)","v":{"$error":"#N/A"}}]
[null,36,99,2,null,null,null,null,null,null,null,"A991","1.75",1.75,0.3125,{"$f":"Frame_Width-2.8125","v":-2.8125},null,{"$f":"Frame_Height-(INT((Frame_Height-(N106+0.5+ACHEIGHT+O106))*16+0.5)/16)","v":2.5625},null,null,null,null,null,null,null,null,null,"Bottom Bottom Rail",{"$f":"(TRUNC((Frame_Width/2+0.25-2.0625)*32+0.5)/32)/12","v":-0.1484375},0.216,-3.2062500000000001E-2,null,"Bottom Bottom Rail",{"$f":"(TRUNC((Frame_Width/2-2.3125)*32+0.5)/32)/12","v":-0.19010416666666666},0.216,-4.1062499999999995E-2,null,null,null,{"$error":"#N/A"},{"$error":"#N/A"},{"$f":"IF(AND(AO106=25,$AM$4>=19,$AM$4<=23.99),AO106&\"-\"&\"5\",0)","v":{"$error":"#N/A"}},null,null,{"$error":"#N/A"},{"$error":"#N/A"},{"$f":"IF(AND(AT106=25,$AR$4>=19,$AR$4<=23.99),AT106&\"-\"&\"5\",0)","v":{"$error":"#N/A"}},null,null,null,null,null,null,null,null,null,null,null,null,null,null,null,null,null,null,null,{"$error":"#N/A"},{"$error":"#N/A"},{"$f":"IF(AND(BP106=22,$BN$4>=31,$BN$4<=34),BP106&\"G\",0)","v":{"$error":"#N/A"}},null,null,{"$error":"#N/A"},{"$error":"#N/A"},{"$f":"IF(AND(BU106=22,$BS$4>=31,$BS$4<=34),BU106&\"G\",0)","v":{"$error":"#N/A"}}]
[null,37,766,3,null,null,null,null,null,null,null,"A501",2.125,2.6890000000000001,null,{"$f":"Frame_Width-4.875","v":-4.875},{"$f":"INT((Frame_Height-(M107+N107+0.5+ACHEIGHT))*16+0.5)/16","v":-5.3125},null,null,null,null,null,null,null,null,null,null,"Bottom Stile",{"$f":"((CDIM7SH2-0.875)*2)/12","v":-0.14583333333333334},0.185,-2.6979166666666669E-2,null,"Bottom Stile",{"$f":"((CDIM8SH2-1.5)*2)/12","v":-0.25},0.185,-4.6249999999999999E-2,null,null,null,{"$error":"#N/A"},{"$error":"#N/A"},{"$f":"IF(AND(AO107=25,$AM$4>=24,$AM$4<=28.99),AO107&\"-\"&\"6\",0)","v":{"$error":"#N/A"}},null,null,{"$error":"#N/A"},{"$error":"#N/A"},{"$f":"IF(AND(AT107=25,$AR$4>=24,$AR$4<=28.99),AT107&\"-\"&\"6\",0)","v":{"$error":"#N/A"}},"x",null,null,null,null,null,null,null,null,null,null,null,null,null,null,null,null,null,null,{"$error":"#N/A"},{"$error":"#N/A"},{"$f":"IF(AND(BP107=22,$BN$4>=35,$BN$4<=37),BP107&\"H\",0)","v":{"$error":"#N/A"}},null,null,{"$error":"#N/A"},{"$error":"#N/A"},{"$f":"IF(AND(BU107=22,$BS$4>=35,$BS$4<=37),BU107&\"H\",0)","v":{"$error":"#N/A"}}]
[null,38,766,3,null,null,null,null,null,null,null,"02S0",null,1.75,0.625,{"$f":"Frame_Width-2.25","v":-2.25},null,{"$f":"Frame_Height-(INT((Frame_Height-(N108+0.5+ACHEIGHT+O108))*16+0.5)/16)","v":2.875},null,null,null,null,null,null,null,null,null,"Bottom Rail Reinf.",{"$f":"((AC105*12)-3)/12","v":-0.3984375},0.17199999999999999,-6.8531249999999988E-2,null,"Bottom Rail Reinf.",{"$f":"((AH105*12)-2.6875)/12","v":-0.4140625},0.17199999999999999,-7.1218749999999997E-2,null,null,null,{"$error":"#N/A"},{"$error":"#N/A"},{"$f":"IF(AND(AO108=25,$AM$4>=29,$AM$4<=33.99),AO108&\"-\"&\"9\",0)","v":{"$error":"#N/A"}},null,null,{"$error":"#N/A"},{"$error":"#N/A"},{"$f":"IF(AND(AT108=25,$AR$4>=29,$AR$4<=33.99),AT108&\"-\"&\"9\",0)","v":{"$error":"#N/A"}},null,null,null,null,null,null,null,null,null,null,null,null,null,null,null,null,null,null,null,{"$error":"#N/A"},{"$error":"#N/A"},{"$f":"IF(AND(BP108=22,$BN$4>=38,$BN$4<=40),BP108&\"I\",0)","v":{"$error":"#N/A"}},null,null,{"$error":"#N/A"},{"$error":"#N/A"},{"$f":"IF(AND(BU108=22,$BS$4>=38,$BS$4<=40),BU108&\"I\",0)","v":{"$error":"#N/A"}}]
[null,39,866,3,null,null,null,null,null,null,null,"A140",null,1.875,1.25,{"$f":"Frame_Width-3.125","v":-3.125},null,{"$f":"Frame_Height-(INT((Frame_Height-(N109+0.5+ACHEIGHT+O109))*16+0.5)/16)","v":3.625},null,null,null,null,null,null,null,null,null,"Bottom Stile Reinf.",null,null,0,null,"Bottom Stile Reinf.",null,null,0,null,null,null,{"$error":"#N/A"},{"$error":"#N/A"},{"$f":"IF(AND(AO109=25,$AM$4>=34,$AM$4<=35.99),AO109&\"-\"&\"11\",0)","v":{"$error":"#N/A"}},null,null,{"$error":"#N/A"},{"$error":"#N/A"},{"$f":"IF(AND(AT109=25,$AR$4>=34,$AR$4<=35.99),AT109&\"-\"&\"11\",0)","v":{"$error":"#N/A"}},null,null,null,null,null,null,null,null,null,null,null,null,null,null,null,null,null,null,null,{"$error":"#N/A"},{"$error":"#N/A"},{"$f":"IF(AND(BP109=22,$BN$4>=41,$BN$4<=42),\"Dbl.\"&BP109&\"C\",0)","v":{"$error":"#N/A"}},null,null,{"$error":"#N/A"},{"$error":"#N/A"},{"$f":"IF(AND(BU109=22,$BS$4>=41,$BS$4<=42),\"Dbl.\"&BU109&\"C\",0)","v":{"$error":"#N/A"}}]
[null,40,866,3,null,null,null,null,null,null,null,"A144",null,1.875,1.25,{"$f":"Frame_Width-3.125","v":-3.125},null,{"$f":"Frame_Height-(INT((Frame_Height-(N110+0.5+ACHEIGHT+O110))*16+0.5)/16)","v":3.625},null,null,null,null,null,null,null,null,null,"Bottom Glass",{"$f":"(((AC105*12)-2.1875)*((AC107*12)-2.1875))/144","v":0.1085205078125},{"$f":"$H$10","v":2.3140000000000001},0.25111645507812502,null,"Bottom Glass",{"$f":"(((AH105*12)-2.5625)*((AH107*12)-2.5))/144","v":0.18500434027777779},{"$f":"$H$10","v":2.3140000000000001},0.4281000434027778,null,null,null,{"$error":"#N/A"},{"$error":"#N/A"},{"$f":"IF(AND(AO110=25,$AM$4>=36,$AM$4<=38.99),AO110&\"-\"&\"12\",0)","v":{"$error":"#N/A"}},null,null,{"$error":"#N/A"},{"$error":"#N/A"},{"$f":"IF(AND(AT110=25,$AR$4>=36,$AR$4<=38.99),AT110&\"-\"&\"12\",0)","v":{"$error":"#N/A"}},null,null,null,null,null,null,null,null,null,null,null,null,null,null,null,null,null,null,null,{"$error":"#N/A"},{"$error":"#N/A"},{"$f":"IF(AND(BP110=22,$BN$4>=43,$BN$4<=48),\"Dbl.\"&BP110&\"D\",0)","v":{"$error":"#N/A"}},null,null,{"$error":"#N/A"},{"$error":"#N/A"},{"$f":"IF(AND(BU110=22,$BS$4>=43,$BS$4<=48),\"Dbl.\"&BU110&\"D\",0)","v":{"$error":"#N/A"}}]
[null,41,777,3,null,null,null,null,null,null,null,"A146",null,1.875,1.25,{"$f":"Frame_Width-3.125","v":-3.125},null,{"$f":"Frame_Height-(INT((Frame_Height-(N111+0.5+ACHEIGHT+O111))*16+0.5)/16)","v":3.625},null,null,null,null,null,null,null,null,null,"Bottom Spacer",{"$f":"(((AC105*12)*2)+((AC107*12)*2))/12","v":-0.58854166666666663},5.3600000000000002E-2,{"$f":"AC111*AD111","v":-3.1545833333333335E-2},null,"Bottom Spacer",{"$f":"(((AH105*12)*2)+((AH107*12)*2))/12","v":-0.88020833333333337},5.3600000000000002E-2,{"$f":"AH111*AI111","v":-4.7179166666666668E-2},null,null,null,{"$error":"#N/A"},{"$error":"#N/A"},{"$f":"IF(AND(AO111=25,$AM$4>=39,$AM$4<=41.99),AO111&\"-\"&\"13\",0)","v":{"$error":"#N/A"}},null,null,{"$error":"#N/A"},{"$error":"#N/A"},{"$f":"IF(AND(AT111=25,$AR$4>=39,$AR$4<=41.99),AT111&\"-\"&\"13\",0)","v":{"$error":"#N/A"}},null,null,null,null,null,null,null,null,null,null,null,null,null,null,null,null,null,null,null,{"$error":"#N/A"},{"$error":"#N/A"},{"$f":"IF(AND(BP111=22,$BN$4>=49,$BN$4<=54),\"Dbl.\"&BP111&\"E\",0)","v":{"$error":"#N/A"}},null,null,{"$error":"#N/A"},{"$error":"#N/A"},{"$f":"IF(AND(BU111=22,$BS$4>=49,$BS$4<=54),\"Dbl.\"&BU111&\"E\",0)","v":{"$error":"#N/A"}}]
[null,42,777,3,null,null,null,null,null,null,null,"A740",null,1.4375,1,{"$f":"Frame_Width-2.125","v":-2.125},null,{"$f":"LEG-(INT((LEG-(N112+0.5+ACHEIGHT+O112))*16+0.5)/16)","v":2.9375},null,null,null,null,null,null,null,null,null,"Bottom Hardware",1,0.36,{"$f":"AC112*AD112","v":0.36},null,"Bottom Hardware",1,0.36,{"$f":"AH112*AI112","v":0.36},null,null,null,{"$error":"#N/A"},{"$error":"#N/A"},{"$f":"IF(AND(AO112=25,$AM$4>=42,$AM$4<=44.99),AO112&\"-\"&\"14\",0)","v":{"$error":"#N/A"}},null,null,{"$error":"#N/A"},{"$error":"#N/A"},{"$f":"IF(AND(AT112=25,$AR$4>=42,$AR$4<=44.99),AT112&\"-\"&\"14\",0)","v":{"$error":"#N/A"}},null,null,null,null,null,null,null,null,null,null,null,null,null,null,null,null,null,null,null,{"$error":"#N/A"},{"$error":"#N/A"},{"$f":"IF(AND(BP112=22,$BN$4>=55,$BN$4<=60),\"Dbl.\"&BP112&\"F\",0)","v":{"$error":"#N/A"}},null,null,{"$error":"#N/A"},{"$error":"#N/A"},{"$f":"IF(AND(BU112=22,$BS$4>=55,$BS$4<=60),\"Dbl.\"&BU112&\"F\",0)","v":{"$error":"#N/A"}}]
[null,43,877,3,null,null,null,null,null,null,null,"A744",null,1.4375,1,{"$f":"Frame_Width-2.125","v":-2.125},null,2.9375,null,null,null,null,null,null,null,null,null,"Bottom Bead",{"$f":"((((AC105*12)-1.875)*2)+(((AC107*12)-1.875)*2))/12","v":-1.2135416666666667},1.9E-2,{"$f":"AC113*AD113","v":-2.3057291666666667E-2},null,"Bottom Bead",{"$f":"((((AH105*12)-2.25)*2)+(((AH107*12)-2.25)*2))/12","v":-1.6302083333333333},1.9E-2,{"$f":"AH113*AI113","v":-3.0973958333333333E-2},null,null,null,{"$error":"#N/A"},{"$error":"#N/A"},{"$f":"IF(AND(AO113=25,$AM$4>=45,$AM$4<=46.99),AO113&\"-\"&\"15\",0)","v":{"$error":"#N/A"}},null,null,{"$error":"#N/A"},{"$error":"#N/A"},{"$f":"IF(AND(AT113=25,$AR$4>=45,$AR$4<=46.99),AT113&\"-\"&\"15\",0)","v":{"$error":"#N/A"}},null,null,null,null,null,null,null,null,null,null,null,null,null,null,null,null,null,null,null,{"$error":"#N/A"},{"$error":"#N/A"},{"$f":"IF(AND(BP113=22,$BN$4>=61,$BN$4<=68),\"Dbl.\"&BP113&\"G\",0)","v":{"$error":"#N/A"}},null,null,{"$error":"#N/A"},{"$error":"#N/A"},{"$f":"IF(AND(BU113=22,$BS$4>=61,$BS$4<=68),\"Dbl.\"&BU113&\"G\",0)","v":{"$error":"#N/A"}}]
[null,44,877,3,null,null,null,null,null,null,null,"A746",null,1.4375,1,{"$f":"Frame_Width-2.125","v":-2.125},null,2.9375,null,null,null,null,null,null,null,null,null,null,null,"Top Sash",0,null,null,null,"Top Sash",0,null,null,null,{"$error":"#N/A"},{"$error":"#N/A"},{"$f":"IF(AND(AO114=25,$AM$4>=47,$AM$4<=49),AO114&\"-\"&\"16\",0)","v":{"$error":"#N/A"}},null,null,{"$error":"#N/A"},{"$error":"#N/A"},{"$f":"IF(AND(AT114=25,$AR$4>=47,$AR$4<=49),AT114&\"-\"&\"16\",0)","v":{"$error":"#N/A"}},null,null,null,null,null,null,null,null,null,null,null,null,null,null,null,null,null,null,null,{"$error":"#N/A"},{"$error":"#N/A"},{"$f":"IF(AND(BP114=22,$BN$4>=69,$BN$4<=74),\"Dbl.\"&BP114&\"H\",0)","v":{"$error":"#N/A"}},null,null,{"$error":"#N/A"},{"$error":"#N/A"},{"$f":"IF(AND(BU114=22,$BS$4>=69,$BS$4<=74),\"Dbl.\"&BU114&\"H\",0)","v":{"$error":"#N/A"}}]
[null,45,878,3,null,null,null,null,null,null,null,"A840",null,1.75,1.25,{"$f":"Frame_Width-2.8125","v":-2.8125},null,3.5,null,null,null,null,null,null,null,null,null,null,null,"Bottom Sash",{"$f":"IF(ModelNo=\"7SH2\",TRUNC(SUM(AE105:AE113)),0)","v":0},null,null,null,"Bottom Sash",{"$f":"IF(ModelNo=\"8SH2\",TRUNC(SUM(AJ105:AJ113)),0)","v":0},null,null,null,{"$f":"IF(AND(AO115>0,AP115>0),AO115,0)","v":{"$error":"#N/A"}},{"$f":"IF(AND($AN$4<=27,$AN$4>25),27,0)","v":{"$error":"#N/A"}},{"$f":"IF(AND(AO115=27,$AM$4>=5,$AM$4<=7.99),AO115&\"-\"&\"1\",0)","v":{"$error":"#N/A"}},null,null,{"$error":"#N/A"},{"$f":"IF(AND($AS$4<=27,$AS$4>25),27,0)","v":{"$error":"#N/A"}},{"$f":"IF(AND(AT115=27,$AR$4>=5,$AR$4<=7.99),AT115&\"-\"&\"1\",0)","v":{"$error":"#N/A"}},null,null,null,null,null,null,null,null,null,null,null,null,null,null,null,null,null,null,null,{"$error":"#N/A"},{"$error":"#N/A"},{"$f":"IF(AND(BP115=22,$BN$4>=75,$BN$4<=80),\"Dbl.\"&BP115&\"I\",0)","v":{"$error":"#N/A"}},null,null,{"$error":"#N/A"},{"$error":"#N/A"},{"$f":"IF(AND(BU115=22,$BS$4>=75,$BS$4<=80),\"Dbl.\"&BU115&\"I\",0)","v":{"$error":"#N/A"}}]
[null,46,878,3,null,null,null,null,null,null,null,"A844",null,1.75,1.25,{"$f":"Frame_Width-2.8125","v":-2.8125},null,3.5,null,null,null,null,null,null,null,null,null,null,null,null,null,null,null,null,null,null,null,null,null,{"$error":"#N/A"},{"$error":"#N/A"},{"$f":"IF(AND(AO116=27,$AM$4>=8,$AM$4<=11.99),AO116&\"-\"&\"2\",0)","v":{"$error":"#N/A"}},null,null,{"$error":"#N/A"},{"$error":"#N/A"},{"$f":"IF(AND(AT116=27,$AR$4>=8,$AR$4<=11.99),AT116&\"-\"&\"2\",0)","v":{"$error":"#N/A"}},null,null,null,null,null,null,null,null,null,null,null,null,null,null,null,null,null,null,null,{"$error":"#N/A"},{"$f":"IF(AND($BO$4<=24,$BO$4>22),24,0)","v":{"$error":"#N/A"}},{"$f":"IF(AND(BP116=24,$BN$4>=6,$BN$4<=10),BP116&\"A\",0)","v":{"$error":"#N/A"}},null,null,{"$error":"#N/A"},{"$f":"IF(AND($BT$4<=24,$BT$4>22),24,0)","v":{"$error":"#N/A"}},{"$f":"IF(AND(BU116=24,$BS$4>=6,$BS$4<=10),BU116&\"A\",0)","v":{"$error":"#N/A"}}]
[null,47,888,3,null,null,null,null,null,null,null,"A846",null,1.75,1.25,{"$f":"Frame_Width-2.8125","v":-2.8125},null,3.5,null,null,null,null,null,null,null,null,null,"7SH3","Length","Weight/ft","Weight",null,"8SH3","Length","Weight/ft","Weight",null,null,null,{"$error":"#N/A"},{"$error":"#N/A"},{"$f":"IF(AND(AO117=27,$AM$4>=12,$AM$4<=16.99),AO117&\"-\"&\"3\",0)","v":{"$error":"#N/A"}},null,null,{"$error":"#N/A"},{"$error":"#N/A"},{"$f":"IF(AND(AT117=27,$AR$4>=12,$AR$4<=16.99),AT117&\"-\"&\"3\",0)","v":{"$error":"#N/A"}},null,null,null,null,null,null,null,null,null,null,null,null,null,null,null,null,null,null,null,{"$error":"#N/A"},{"$error":"#N/A"},{"$f":"IF(AND(BP117=24,$BN$4>=11,$BN$4<=17),BP117&\"B\",0)","v":{"$error":"#N/A"}},null,null,{"$error":"#N/A"},{"$error":"#N/A"},{"$f":"IF(AND(BU117=24,$BS$4>=11,$BS$4<=17),BU117&\"B\",0)","v":{"$error":"#N/A"}}]
[null,48,888,3,null,null,null,null,null,null,null,"7SH2",1.625,1.625,null,{"$f":"TRUNC((Frame_Width/2+0.25-2.0625)*32+0.5)/32","v":-1.78125},null,{"$f":"Frame_Height-(INT((Frame_Height-(N118+0.5+ACHEIGHT+O118))*16+0.5)/16)","v":2.125},null,null,null,null,null,null,null,null,null,"Top Top Rail",0,0,{"$f":"AC118*AD118","v":0},null,"Top Top Rail",0,0,{"$f":"AH118*AI118","v":0},null,null,null,{"$error":"#N/A"},{"$error":"#N/A"},{"$f":"IF(AND(AO118=27,$AM$4>=17,$AM$4<=21.99),AO118&\"-\"&\"4\",0)","v":{"$error":"#N/A"}},null,null,{"$error":"#N/A"},{"$error":"#N/A"},{"$f":"IF(AND(AT118=27,$AR$4>=17,$AR$4<=21.99),AT118&\"-\"&\"4\",0)","v":{"$error":"#N/A"}},null,null,null,null,null,null,null,null,null,null,null,null,null,null,null,null,null,null,null,{"$error":"#N/A"},{"$error":"#N/A"},{"$f":"IF(AND(BP118=24,$BN$4>=18,$BN$4<=22),BP118&\"C\",0)","v":{"$error":"#N/A"}},null,null,{"$error":"#N/A"},{"$error":"#N/A"},{"$f":"IF(AND(BU118=24,$BS$4>=18,$BS$4<=22),BU118&\"C\",0)","v":{"$error":"#N/A"}}]
[null,49,889,3,null,null,null,null,null,null,null,"7SH3",1.625,1.625,null,{"$f":"TRUNC((((Frame_Width+0.5)-5.6875)/3)*32)/32","v":-1.71875},null,2.125,null,null,null,null,null,null,null,null,null,"Top Bottom Rail",0,0,{"$f":"AC119*AD119","v":0},null,"Top Bottom Rail",0,0,{"$f":"AH119*AI119","v":0},null,null,null,{"$error":"#N/A"},{"$error":"#N/A"},{"$f":"IF(AND(AO119=27,$AM$4>=22,$AM$4<=26.99),AO119&\"-\"&\"5\",0)","v":{"$error":"#N/A"}},null,null,{"$error":"#N/A"},{"$error":"#N/A"},{"$f":"IF(AND(AT119=27,$AR$4>=22,$AR$4<=26.99),AT119&\"-\"&\"5\",0)","v":{"$error":"#N/A"}},null,null,null,null,null,null,null,null,null,null,null,null,null,null,null,null,null,null,null,{"$error":"#N/A"},{"$error":"#N/A"},{"$f":"IF(AND(BP119=24,$BN$4>=23,$BN$4<=25),BP119&\"D\",0)","v":{"$error":"#N/A"}},null,null,{"$error":"#N/A"},{"$error":"#N/A"},{"$f":"IF(AND(BU119=24,$BS$4>=23,$BS$4<=25),BU119&\"D\",0)","v":{"$error":"#N/A"}}]
[null,50,889,3,null,null,null,null,null,null,null,"8SH2",1.75,1.75,null,{"$f":"TRUNC((Frame_Width/2-2.3125)*32+0.5)/32","v":-2.28125},null,2.25,null,null,null,null,null,null,null,null,null,"Top Stile",0,0,{"$f":"(AC120*AD120)/12","v":0},null,"Top Stile",0,0,{"$f":"(AH120*AI120)/12","v":0},null,null,null,{"$error":"#N/A"},{"$error":"#N/A"},{"$f":"IF(AND(AO120=27,$AM$4>=27,$AM$4<=30.99),AO120&\"-\"&\"6\",0)","v":{"$error":"#N/A"}},null,null,{"$error":"#N/A"},{"$error":"#N/A"},{"$f":"IF(AND(AT120=27,$AR$4>=27,$AR$4<=30.99),AT120&\"-\"&\"6\",0)","v":{"$error":"#N/A"}},null,null,null,null,null,null,null,null,null,null,null,null,null,null,null,null,null,null,null,{"$error":"#N/A"},{"$error":"#N/A"},{"$f":"IF(AND(BP120=24,$BN$4>=26,$BN$4<=28),BP120&\"E\",0)","v":{"$error":"#N/A"}},null,null,{"$error":"#N/A"},{"$error":"#N/A"},{"$f":"IF(AND(BU120=24,$BS$4>=26,$BS$4<=28),BU120&\"E\",0)","v":{"$error":"#N/A"}}]
[null,51,899,3,null,null,null,null,null,null,null,"8SH3",1.75,1.75,null,{"$f":"TRUNC(((Frame_Width/3)-2.779875+0.57)*32+0.5)/32","v":-2.1875},null,2.25,null,null,null,null,null,null,null,null,null,"Top Rail Reinf.",0,0,0,null,"Top Rail Reinf.",0,0,0,null,null,null,{"$error":"#N/A"},{"$error":"#N/A"},{"$f":"IF(AND(AO121=27,$AM$4>=31,$AM$4<=35.99),AO121&\"-\"&\"9\",0)","v":{"$error":"#N/A"}},null,null,{"$error":"#N/A"},{"$error":"#N/A"},{"$f":"IF(AND(AT121=27,$AR$4>=31,$AR$4<=35.99),AT121&\"-\"&\"9\",0)","v":{"$error":"#N/A"}},"x",null,null,null,null,null,null,null,null,null,null,null,null,null,null,null,null,null,null,{"$error":"#N/A"},{"$error":"#N/A"},{"$f":"IF(AND(BP121=24,$BN$4>=29,$BN$4<=30),BP121&\"F\",0)","v":{"$error":"#N/A"}},null,null,{"$error":"#N/A"},{"$error":"#N/A"},{"$f":"IF(AND(BU121=24,$BS$4>=29,$BS$4<=30),BU121&\"F\",0)","v":{"$error":"#N/A"}}]
[null,52,899,3,null,null,null,null,null,null,null,"82SP",1.75,1.75,null,{"$f":"Data!D800","v":-2.3125},null,2.25,null,null,null,null,null,null,null,null,null,"Top Stile Reinf",0,0,0,null,"Top Stile Reinf",0,0,0,null,null,null,{"$error":"#N/A"},{"$error":"#N/A"},{"$f":"IF(AND(AO122=27,$AM$4>=36,$AM$4<=36.99),AO122&\"-\"&\"11\",0)","v":{"$error":"#N/A"}},null,null,{"$error":"#N/A"},{"$error":"#N/A"},{"$f":"IF(AND(AT122=27,$AR$4>=36,$AR$4<=36.99),AT122&\"-\"&\"11\",0)","v":{"$error":"#N/A"}},null,null,null,null,null,null,null,null,null,null,null,null,null,null,null,null,null,null,null,{"$error":"#N/A"},{"$error":"#N/A"},{"$f":"IF(AND(BP122=24,$BN$4>=31,$BN$4<=34),BP122&\"G\",0)","v":{"$error":"#N/A"}},null,null,{"$error":"#N/A"},{"$error":"#N/A"},{"$f":"IF(AND(BU122=24,$BS$4>=31,$BS$4<=34),BU122&\"G\",0)","v":{"$error":"#N/A"}}]
[null,53,999,3,null,null,null,null,null,null,null,"8SPS",1.75,1.75,null,{"$f":"Data!D816","v":-2.3125},null,2.25,null,null,null,null,null,null,null,null,null,"Top Glass",0,0,0,null,"Top Glass",0,0,0,null,null,null,{"$error":"#N/A"},{"$error":"#N/A"},{"$f":"IF(AND(AO123=27,$AM$4>=37,$AM$4<=39.99),AO123&\"-\"&\"12\",0)","v":{"$error":"#N/A"}},null,null,{"$error":"#N/A"},{"$error":"#N/A"},{"$f":"IF(AND(AT123=27,$AR$4>=37,$AR$4<=39.99),AT123&\"-\"&\"12\",0)","v":{"$error":"#N/A"}},null,null,null,null,null,null,null,null,null,null,null,null,null,null,null,null,null,null,null,{"$error":"#N/A"},{"$error":"#N/A"},{"$f":"IF(AND(BP123=24,$BN$4>=35,$BN$4<=37),BP123&\"H\",0)","v":{"$error":"#N/A"}},null,null,{"$error":"#N/A"},{"$error":"#N/A"},{"$f":"IF(AND(BU123=24,$BS$4>=35,$BS$4<=37),BU123&\"H\",0)","v":{"$error":"#N/A"}}]
[null,54,999,3,null,null,null,null,null,null,null,"8SPP",1.75,1.75,null,{"$f":"Data!D832","v":-2.3125},null,2.25,null,null,null,null,null,null,null,null,null,"Top Spacer",0,0,0,null,"Top Spacer",0,0,0,null,null,null,{"$error":"#N/A"},{"$error":"#N/A"},{"$f":"IF(AND(AO124=27,$AM$4>=40,$AM$4<=42.99),AO124&\"-\"&\"13\",0)","v":{"$error":"#N/A"}},null,null,{"$error":"#N/A"},{"$error":"#N/A"},{"$f":"IF(AND(AT124=27,$AR$4>=40,$AR$4<=42.99),AT124&\"-\"&\"13\",0)","v":{"$error":"#N/A"}},null,null,null,null,null,null,null,null,null,null,null,null,null,null,null,null,null,null,null,{"$error":"#N/A"},{"$error":"#N/A"},{"$f":"IF(AND(BP124=24,$BN$4>=38,$BN$4<=40),BP124&\"I\",0)","v":{"$error":"#N/A"}},null,null,{"$error":"#N/A"},{"$error":"#N/A"},{"$f":"IF(AND(BU124=24,$BS$4>=38,$BS$4<=40),BU124&\"I\",0)","v":{"$error":"#N/A"}}]
[null,55,6679,4,null,null,null,null,null,null,null,"8POS",1.75,1.75,null,{"$f":"Data!D850","v":-2.75},null,{"$f":"Frame_Height-(INT((Frame_Height-(N125+0.5+ACHEIGHT+O125))*16+0.5)/16)","v":2.25},null,null,null,null,null,null,null,null,null,"Top Hardware",0,0,0,null,"Top Hardware",0,0,0,null,null,null,{"$error":"#N/A"},{"$error":"#N/A"},{"$f":"IF(AND(AO125=27,$AM$4>=43,$AM$4<=44.99),AO125&\"-\"&\"14\",0)","v":{"$error":"#N/A"}},null,null,{"$error":"#N/A"},{"$error":"#N/A"},{"$f":"IF(AND(AT125=27,$AR$4>=43,$AR$4<=44.99),AT125&\"-\"&\"14\",0)","v":{"$error":"#N/A"}},null,null,null,null,null,null,null,null,null,null,null,null,null,null,null,null,null,null,null,{"$error":"#N/A"},{"$error":"#N/A"},{"$f":"IF(AND(BP125=24,$BN$4>=41,$BN$4<=44),\"Dbl.\"&BP125&\"C\",0)","v":{"$error":"#N/A"}},null,null,{"$error":"#N/A"},{"$error":"#N/A"},{"$f":"IF(AND(BU125=24,$BS$4>=41,$BS$4<=44),\"Dbl.\"&BU125&\"C\",0)","v":{"$error":"#N/A"}}]
[null,56,6679,4,null,null,null,null,null,null,null,"8SOP",1.75,1.75,null,{"$f":"FLOOR(Frame_Width-2.8125,0.0625)","v":-2.8125},null,{"$f":"Frame_Height-(INT((Frame_Height-(N126+0.5+ACHEIGHT+O126))*16+0.5)/16)","v":2.25},null,null,null,null,null,null,null,null,null,"Top Bead",0,0,0,null,"Top Bead",0,0,0,null,null,null,{"$error":"#N/A"},{"$error":"#N/A"},{"$f":"IF(AND(AO126=27,$AM$4>=45,$AM$4<=46.99),AO126&\"-\"&\"15\",0)","v":{"$error":"#N/A"}},null,null,{"$error":"#N/A"},{"$error":"#N/A"},{"$f":"IF(AND(AT126=27,$AR$4>=45,$AR$4<=46.99),AT126&\"-\"&\"15\",0)","v":{"$error":"#N/A"}},null,null,null,null,null,null,null,null,null,null,null,null,null,null,null,null,null,null,null,{"$error":"#N/A"},{"$error":"#N/A"},{"$f":"IF(AND(BP126=24,$BN$4>=45,$BN$4<=50),\"Dbl.\"&BP126&\"D\",0)","v":{"$error":"#N/A"}},null,null,{"$error":"#N/A"},{"$error":"#N/A"},{"$f":"IF(AND(BU126=24,$BS$4>=45,$BS$4<=50),\"Dbl.\"&BU126&\"D\",0)","v":{"$error":"#N/A"}}]
[null,57,6779,4,null,null,null,null,null,null,null,null,null,null,null,null,null,null,null,null,null,null,null,null,null,null,null,"Bottom Top Rail",{"$f":"(TRUNC((((Frame_Width+0.5)-5.6875)/3)*32)/32)/12","v":-0.14322916666666666},0.24299999999999999,{"$f":"AC127*AD127","v":-3.4804687499999994E-2},null,"Bottom Top Rail",{"$f":"(TRUNC(((Frame_Width/3)-2.779875+0.57)*32+0.5)/32)/12","v":-0.18229166666666666},0.24299999999999999,{"$f":"AH127*AI127","v":-4.4296874999999999E-2},null,null,null,{"$error":"#N/A"},{"$error":"#N/A"},{"$f":"IF(AND(AO127=27,$AM$4>=47,$AM$4<=50),AO127&\"-\"&\"16\",0)","v":{"$error":"#N/A"}},null,null,{"$error":"#N/A"},{"$error":"#N/A"},{"$f":"IF(AND(AT127=27,$AR$4>=47,$AR$4<=50),AT127&\"-\"&\"16\",0)","v":{"$error":"#N/A"}},null,null,null,null,null,null,null,null,null,null,null,null,null,null,null,null,null,null,null,{"$error":"#N/A"},{"$error":"#N/A"},{"$f":"IF(AND(BP127=24,$BN$4>=51,$BN$4<=56),\"Dbl.\"&BP127&\"E\",0)","v":{"$error":"#N/A"}},null,null,{"$error":"#N/A"},{"$error":"#N/A"},{"$f":"IF(AND(BU127=24,$BS$4>=51,$BS$4<=56),\"Dbl.\"&BU127&\"E\",0)","v":{"$error":"#N/A"}}]
[null,58,6779,4,null,null,null,null,null,null,null,null,null,null,null,null,null,null,null,null,null,null,null,null,null,null,null,"Bottom Bottom Rail",{"$f":"(TRUNC((((Frame_Width+0.5)-5.6875)/3)*32)/32)/12","v":-0.14322916666666666},0.216,-3.0937499999999996E-2,null,"Bottom Bottom Rail",{"$f":"(TRUNC(((Frame_Width/3)-2.779875+0.57)*32+0.5)/32)/12","v":-0.18229166666666666},0.216,-3.9375E-2,null,null,null,{"$f":"IF(AND(AO128>0,AP128>0),AO128,0)","v":{"$error":"#N/A"}},{"$f":"IF(AND($AN$4<=29,$AN$4>27),29,0)","v":{"$error":"#N/A"}},{"$f":"IF(AND(AO128=29,$AM$4>=6,$AM$4<=8.99),AO128&\"-\"&\"1\",0)","v":{"$error":"#N/A"}},null,null,{"$error":"#N/A"},{"$f":"IF(AND($AS$4<=29,$AS$4>27),29,0)","v":{"$error":"#N/A"}},{"$f":"IF(AND(AT128=29,$AR$4>=6,$AR$4<=8.99),AT128&\"-\"&\"1\",0)","v":{"$error":"#N/A"}},null,null,null,null,null,null,null,null,null,null,null,null,null,null,null,null,null,null,null,{"$error":"#N/A"},{"$error":"#N/A"},{"$f":"IF(AND(BP128=24,$BN$4>=57,$BN$4<=60),\"Dbl.\"&BP128&\"F\",0)","v":{"$error":"#N/A"}},null,null,{"$error":"#N/A"},{"$error":"#N/A"},{"$f":"IF(AND(BU128=24,$BS$4>=57,$BS$4<=60),\"Dbl.\"&BU128&\"F\",0)","v":{"$error":"#N/A"}}]
[null,59,7779,4,null,null,null,null,null,null,null,null,null,null,null,null,null,null,null,null,null,null,null,null,null,null,null,"Bottom Stile",{"$f":"((CDIM7SH3-0.875)*2)/12","v":-0.14583333333333334},0.185,-2.6979166666666669E-2,null,"Bottom Stile",{"$f":"((CDIM8SH3-1.5)*2)/12","v":-0.25},0.185,-4.6249999999999999E-2,null,null,null,{"$error":"#N/A"},{"$error":"#N/A"},{"$f":"IF(AND(AO129=29,$AM$4>=9,$AM$4<=12.99),AO129&\"-\"&\"2\",0)","v":{"$error":"#N/A"}},null,null,{"$error":"#N/A"},{"$error":"#N/A"},{"$f":"IF(AND(AT129=29,$AR$4>=9,$AR$4<=12.99),AT129&\"-\"&\"2\",0)","v":{"$error":"#N/A"}},null,null,null,null,null,null,null,null,null,null,null,null,null,null,null,null,null,null,null,{"$error":"#N/A"},{"$error":"#N/A"},{"$f":"IF(AND(BP129=24,$BN$4>=61,$BN$4<=68),\"Dbl.\"&BP129&\"G\",0)","v":{"$error":"#N/A"}},null,null,{"$error":"#N/A"},{"$error":"#N/A"},{"$f":"IF(AND(BU129=24,$BS$4>=61,$BS$4<=68),\"Dbl.\"&BU129&\"G\",0)","v":{"$error":"#N/A"}}]
[null,60,7779,4,null,null,null,null,null,null,null,null,null,null,null,null,null,null,null,null,null,null,null,null,null,null,null,"Bottom Rail Reinf.",{"$f":"((AC127*12)-3)/12","v":-0.39322916666666669},0.17199999999999999,-6.763541666666667E-2,null,"Bottom Rail Reinf.",{"$f":"((AH127*12)-2.6875)/12","v":-0.40625},0.17199999999999999,-6.9874999999999993E-2,null,null,null,{"$error":"#N/A"},{"$error":"#N/A"},{"$f":"IF(AND(AO130=29,$AM$4>=13,$AM$4<=17.99),AO130&\"-\"&\"3\",0)","v":{"$error":"#N/A"}},null,null,{"$error":"#N/A"},{"$error":"#N/A"},{"$f":"IF(AND(AT130=29,$AR$4>=13,$AR$4<=17.99),AT130&\"-\"&\"3\",0)","v":{"$error":"#N/A"}},null,null,null,null,null,null,null,null,null,null,null,null,null,null,null,null,null,null,null,{"$error":"#N/A"},{"$error":"#N/A"},{"$f":"IF(AND(BP130=24,$BN$4>=69,$BN$4<=74),\"Dbl.\"&BP130&\"H\",0)","v":{"$error":"#N/A"}},null,null,{"$error":"#N/A"},{"$error":"#N/A"},{"$f":"IF(AND(BU130=24,$BS$4>=69,$BS$4<=74),\"Dbl.\"&BU130&\"H\",0)","v":{"$error":"#N/A"}}]
[null,61,6799,4,null,null,null,null,null,null,null,null,null,null,null,null,null,null,null,null,null,null,null,null,null,null,null,"Bottom Stile Reinf.",null,null,0,null,"Bottom Stile Reinf.",null,null,0,null,null,null,{"$error":"#N/A"},{"$error":"#N/A"},{"$f":"IF(AND(AO131=29,$AM$4>=18,$AM$4<=23.99),AO131&\"-\"&\"4\",0)","v":{"$error":"#N/A"}},null,null,{"$error":"#N/A"},{"$error":"#N/A"},{"$f":"IF(AND(AT131=29,$AR$4>=18,$AR$4<=23.99),AT131&\"-\"&\"4\",0)","v":{"$error":"#N/A"}},null,null,null,null,null,null,null,null,null,null,null,null,null,null,null,null,null,null,null,{"$error":"#N/A"},{"$error":"#N/A"},{"$f":"IF(AND(BP131=24,$BN$4>=75,$BN$4<=80),\"Dbl.\"&BP131&\"I\",0)","v":{"$error":"#N/A"}},null,null,{"$error":"#N/A"},{"$error":"#N/A"},{"$f":"IF(AND(BU131=24,$BS$4>=75,$BS$4<=80),\"Dbl.\"&BU131&\"I\",0)","v":{"$error":"#N/A"}}]
[null,62,6799,4,null,null,null,null,null,null,null,null,null,null,null,null,null,null,null,null,null,null,null,null,null,null,null,"Bottom Glass",{"$f":"(((AC127*12)-2.1875)*((AC129*12)-2.1875))/144","v":0.1068115234375},{"$f":"$H$10","v":2.3140000000000001},0.247161865234375,null,"Bottom Glass",{"$f":"(((AH127*12)-2.5)*((AH129*12)-2.5))/144","v":0.17903645833333334},{"$f":"$H$10","v":2.3140000000000001},0.41429036458333335,null,null,null,{"$error":"#N/A"},{"$error":"#N/A"},{"$f":"IF(AND(AO132=29,$AM$4>=24,$AM$4<=29.99),AO132&\"-\"&\"5\",0)","v":{"$error":"#N/A"}},null,null,{"$error":"#N/A"},{"$error":"#N/A"},{"$f":"IF(AND(AT132=29,$AR$4>=24,$AR$4<=29.99),AT132&\"-\"&\"5\",0)","v":{"$error":"#N/A"}},null,null,null,null,null,null,null,null,null,null,null,null,null,null,null,null,null,null,null,{"$error":"#N/A"},{"$f":"IF(AND($BO$4<=26,$BO$4>24),26,0)","v":{"$error":"#N/A"}},{"$f":"IF(AND(BP132=26,$BN$4>=6,$BN$4<=11),BP132&\"A\",0)","v":{"$error":"#N/A"}},null,null,{"$error":"#N/A"},{"$f":"IF(AND($BT$4<=26,$BT$4>24),26,0)","v":{"$error":"#N/A"}},{"$f":"IF(AND(BU132=26,$BS$4>=6,$BS$4<=11),BU132&\"A\",0)","v":{"$error":"#N/A"}}]
[null,63,7799,4,null,null,null,null,null,null,null,null,null,null,null,null,null,null,null,null,null,null,null,null,null,null,null,"Bottom Spacer",{"$f":"(((AC127*12)*2)+((AC129*12)*2))/12","v":-0.578125},5.3600000000000002E-2,{"$f":"AC133*AD133","v":-3.0987500000000001E-2},null,"Bottom Spacer",{"$f":"(((AH127*12)*2)+((AH129*12)*2))/12","v":-0.86458333333333337},5.3600000000000002E-2,{"$f":"AH133*AI133","v":-4.634166666666667E-2},null,null,null,{"$error":"#N/A"},{"$error":"#N/A"},{"$f":"IF(AND(AO133=29,$AM$4>=30,$AM$4<=34.99),AO133&\"-\"&\"6\",0)","v":{"$error":"#N/A"}},null,null,{"$error":"#N/A"},{"$error":"#N/A"},{"$f":"IF(AND(AT133=29,$AR$4>=30,$AR$4<=34.99),AT133&\"-\"&\"6\",0)","v":{"$error":"#N/A"}},null,null,null,null,null,null,null,null,null,null,null,null,null,null,null,null,null,null,null,{"$f":"IF(AND(BP133>0,BQ133>0),BP133,0)","v":{"$error":"#N/A"}},{"$error":"#N/A"},{"$f":"IF(AND(BP133=26,$BN$4>=12,$BN$4<=17),BP133&\"B\",0)","v":{"$error":"#N/A"}},null,null,{"$f":"IF(AND(BU133>0,BV133>0),BU133,0)","v":{"$error":"#N/A"}},{"$error":"#N/A"},{"$f":"IF(AND(BU133=26,$BS$4>=12,$BS$4<=17),BU133&\"B\",0)","v":{"$error":"#N/A"}}]
[null,64,7799,4,null,null,null,null,null,null,null,null,null,null,null,null,null,null,null,null,null,null,null,null,null,null,null,"Bottom Hardware",1,0.36,{"$f":"AC134*AD134","v":0.36},null,"Bottom Hardware",1,0.36,{"$f":"AH134*AI134","v":0.36},null,null,null,{"$error":"#N/A"},{"$error":"#N/A"},{"$f":"IF(AND(AO134=29,$AM$4>=35,$AM$4<=37.99),AO134&\"-\"&\"9\",0)","v":{"$error":"#N/A"}},null,null,{"$error":"#N/A"},{"$error":"#N/A"},{"$f":"IF(AND(AT134=29,$AR$4>=35,$AR$4<=37.99),AT134&\"-\"&\"9\",0)","v":{"$error":"#N/A"}},null,null,null,null,null,null,null,null,null,null,null,null,null,null,null,null,null,null,null,{"$error":"#N/A"},{"$error":"#N/A"},{"$f":"IF(AND(BP134=26,$BN$4>=18,$BN$4<=22),BP134&\"C\",0)","v":{"$error":"#N/A"}},null,null,{"$error":"#N/A"},{"$error":"#N/A"},{"$f":"IF(AND(BU134=26,$BS$4>=18,$BS$4<=22),BU134&\"C\",0)","v":{"$error":"#N/A"}}]
[null,65,7899,4,null,null,null,null,null,null,null,null,null,null,null,null,null,null,null,null,null,null,null,null,null,null,null,"Bottom Bead",{"$f":"((((AC127*12)-1.875)*2)+(((AC129*12)-1.875)*2))/12","v":-1.203125},1.9E-2,{"$f":"AC135*AD135","v":-2.2859374999999998E-2},null,"Bottom Bead",{"$f":"((((AH127*12)-2.25)*2)+(((AH129*12)-2.25)*2))/12","v":-1.6145833333333333},1.9E-2,{"$f":"AH135*AI135","v":-3.0677083333333331E-2},null,null,null,{"$error":"#N/A"},{"$error":"#N/A"},{"$f":"IF(AND(AO135=29,$AM$4>=38,$AM$4<=40.99),AO135&\"-\"&\"12\",0)","v":{"$error":"#N/A"}},null,null,{"$error":"#N/A"},{"$error":"#N/A"},{"$f":"IF(AND(AT135=29,$AR$4>=38,$AR$4<=40.99),AT135&\"-\"&\"12\",0)","v":{"$error":"#N/A"}},"x",null,null,null,null,null,null,null,null,null,null,null,null,null,null,null,null,null,null,{"$error":"#N/A"},{"$error":"#N/A"},{"$f":"IF(AND(BP135=26,$BN$4>=23,$BN$4<=26),BP135&\"D\",0)","v":{"$error":"#N/A"}},null,null,{"$error":"#N/A"},{"$error":"#N/A"},{"$f":"IF(AND(BU135=26,$BS$4>=23,$BS$4<=26),BU135&\"D\",0)","v":{"$error":"#N/A"}}]
[null,66,7899,4,null,null,null,null,null,null,null,null,null,null,null,null,null,null,null,null,null,null,null,null,null,null,null,null,null,"Top Sash",0,null,null,null,"Top Sash",0,null,null,null,{"$error":"#N/A"},{"$error":"#N/A"},{"$f":"IF(AND(AO136=29,$AM$4>=41,$AM$4<=42.99),AO136&\"-\"&\"13\",0)","v":{"$error":"#N/A"}},null,null,{"$error":"#N/A"},{"$error":"#N/A"},{"$f":"IF(AND(AT136=29,$AR$4>=41,$AR$4<=42.99),AT136&\"-\"&\"13\",0)","v":{"$error":"#N/A"}},null,null,null,null,null,null,null,null,null,null,null,null,null,null,null,null,null,null,null,{"$error":"#N/A"},{"$error":"#N/A"},{"$f":"IF(AND(BP136=26,$BN$4>=27,$BN$4<=30),BP136&\"E\",0)","v":{"$error":"#N/A"}},null,null,{"$error":"#N/A"},{"$error":"#N/A"},{"$f":"IF(AND(BU136=26,$BS$4>=27,$BS$4<=30),BU136&\"E\",0)","v":{"$error":"#N/A"}}]
[null,67,8899,4,null,null,null,null,null,null,null,null,null,null,null,null,null,null,null,null,null,null,null,null,null,null,null,null,null,"Bottom Sash",{"$f":"IF(ModelNo=\"7SH3\",TRUNC(SUM(AE127:AE135)),0)","v":0},null,null,null,"Bottom Sash",{"$f":"IF(ModelNo=\"8SH3\",TRUNC(SUM(AJ127:AJ135)),0)","v":0},null,null,null,{"$error":"#N/A"},{"$error":"#N/A"},{"$f":"IF(AND(AO137=29,$AM$4>=43,$AM$4<=44.99),AO137&\"-\"&\"14\",0)","v":{"$error":"#N/A"}},null,null,{"$error":"#N/A"},{"$error":"#N/A"},{"$f":"IF(AND(AT137=29,$AR$4>=43,$AR$4<=44.99),AT137&\"-\"&\"14\",0)","v":{"$error":"#N/A"}},null,null,null,null,null,null,null,null,null,null,null,null,null,null,null,null,null,null,null,{"$error":"#N/A"},{"$error":"#N/A"},{"$f":"IF(AND(BP137=26,$BN$4>=31,$BN$4<=34),BP137&\"F\",0)","v":{"$error":"#N/A"}},null,null,{"$error":"#N/A"},{"$error":"#N/A"},{"$f":"IF(AND(BU137=26,$BS$4>=31,$BS$4<=34),BU137&\"F\",0)","v":{"$error":"#N/A"}}]
[null,68,8899,4,null,null,null,null,null,null,null,null,null,null,null,null,null,null,null,null,null,null,null,null,null,null,null,null,null,null,null,null,null,null,null,null,null,null,null,{"$error":"#N/A"},{"$error":"#N/A"},{"$f":"IF(AND(AO138=29,$AM$4>=45,$AM$4<=46.99),AO138&\"-\"&\"15\",0)","v":{"$error":"#N/A"}},null,null,{"$error":"#N/A"},{"$error":"#N/A"},{"$f":"IF(AND(AT138=29,$AR$4>=45,$AR$4<=46.99),AT138&\"-\"&\"15\",0)","v":{"$error":"#N/A"}},null,null,null,null,null,null,null,null,null,null,null,null,null,null,null,null,null,null,null,{"$error":"#N/A"},{"$error":"#N/A"},{"$f":"IF(AND(BP138=26,$BN$4>=35,$BN$4<=38),BP138&\"G\",0)","v":{"$error":"#N/A"}},null,null,{"$error":"#N/A"},{"$error":"#N/A"},{"$f":"IF(AND(BU138=26,$BS$4>=35,$BS$4<=38),BU138&\"G\",0)","v":{"$error":"#N/A"}}]
[null,69,8999,4,null,null,null,null,null,null,null,null,null,null,null,null,null,null,null,null,null,null,null,null,null,null,null,"8SPS","Length","Weight/ft","Weight",null,"82SP","Length","Weight/ft","Weight",null,null,null,{"$error":"#N/A"},{"$error":"#N/A"},{"$f":"IF(AND(AO139=29,$AM$4>=47,$AM$4<=49.99),AO139&\"-\"&\"16\",0)","v":{"$error":"#N/A"}},null,null,{"$error":"#N/A"},{"$error":"#N/A"},{"$f":"IF(AND(AT139=29,$AR$4>=47,$AR$4<=49.99),AT139&\"-\"&\"16\",0)","v":{"$error":"#N/A"}},null,null,null,null,null,null,null,null,null,null,null,null,null,null,null,null,null,null,null,{"$error":"#N/A"},{"$error":"#N/A"},{"$f":"IF(AND(BP139=26,$BN$4>=39,$BN$4<=42),BP139&\"H\",0)","v":{"$error":"#N/A"}},null,null,{"$error":"#N/A"},{"$error":"#N/A"},{"$f":"IF(AND(BU139=26,$BS$4>=39,$BS$4<=42),BU139&\"H\",0)","v":{"$error":"#N/A"}}]
[null,70,8999,4,null,null,null,null,null,null,null,null,null,null,null,null,null,null,null,null,null,null,null,null,null,null,null,"Top Top Rail",0,0,{"$f":"AC140*AD140","v":0},null,"Top Top Rail",0,0,{"$f":"AH140*AI140","v":0},null,null,null,{"$error":"#N/A"},{"$error":"#N/A"},{"$f":"IF(AND(AO140=29,$AM$4>=50,$AM$4<=52),AO140&\"-\"&\"17\",0)","v":{"$error":"#N/A"}},null,null,{"$error":"#N/A"},{"$error":"#N/A"},{"$f":"IF(AND(AT140=29,$AR$4>=50,$AR$4<=52),AT140&\"-\"&\"17\",0)","v":{"$error":"#N/A"}},null,null,null,null,null,null,null,null,null,null,null,null,null,null,null,null,null,null,null,{"$error":"#N/A"},{"$error":"#N/A"},{"$f":"IF(AND(BP140=26,$BN$4>=43,$BN$4<=45),BP140&\"I\",0)","v":{"$error":"#N/A"}},null,null,{"$error":"#N/A"},{"$error":"#N/A"},{"$f":"IF(AND(BU140=26,$BS$4>=43,$BS$4<=45),BU140&\"I\",0)","v":{"$error":"#N/A"}}]
[null,71,9999,4,null,null,null,null,null,null,null,null,null,null,null,null,null,null,null,null,null,null,null,null,null,null,null,"Top Bottom Rail",0,0,{"$f":"AC141*AD141","v":0},null,"Top Bottom Rail",0,0,{"$f":"AH141*AI141","v":0},null,null,null,{"$f":"IF(AND(AO141>0,AP141>0),AO141,0)","v":{"$error":"#N/A"}},{"$f":"IF(AND($AN$4<=31,$AN$4>29),31,0)","v":{"$error":"#N/A"}},{"$f":"IF(AND(AO141=31,$AM$4>=6,$AM$4<=8.99),AO141&\"-\"&\"1\",0)","v":{"$error":"#N/A"}},null,null,{"$f":"IF(AND(AT141>0,AU141>0),AT141,0)","v":{"$error":"#N/A"}},{"$f":"IF(AND($AS$4<=31,$AS$4>29),31,0)","v":{"$error":"#N/A"}},{"$f":"IF(AND(AT141=31,$AR$4>=6,$AR$4<=8.99),AT141&\"-\"&\"1\",0)","v":{"$error":"#N/A"}},null,null,null,null,null,null,null,null,null,null,null,null,null,null,null,null,null,null,null,{"$error":"#N/A"},{"$error":"#N/A"},{"$f":"IF(AND(BP141=26,$BN$4>=46,$BN$4<=52),\"Dbl.\"&BP141&\"D\",0)","v":{"$error":"#N/A"}},null,null,{"$error":"#N/A"},{"$error":"#N/A"},{"$f":"IF(AND(BU141=26,$BS$4>=46,$BS$4<=52),\"Dbl.\"&BU141&\"D\",0)","v":{"$error":"#N/A"}}]
[null,72,9999,4,null,null,null,null,null,null,null,null,null,null,null,null,null,null,null,null,null,null,null,null,null,null,null,"Top Stile",0,0,{"$f":"(AC142*AD142)/12","v":0},null,"Top Stile",0,0,{"$f":"(AH142*AI142)/12","v":0},null,null,null,{"$error":"#N/A"},{"$error":"#N/A"},{"$f":"IF(AND(AO142=31,$AM$4>=9,$AM$4<=12.99),AO142&\"-\"&\"2\",0)","v":{"$error":"#N/A"}},null,null,{"$error":"#N/A"},{"$error":"#N/A"},{"$f":"IF(AND(AT142=31,$AR$4>=9,$AR$4<=12.99),AT142&\"-\"&\"2\",0)","v":{"$error":"#N/A"}},null,null,null,null,null,null,null,null,null,null,null,null,null,null,null,null,null,null,null,{"$error":"#N/A"},{"$error":"#N/A"},{"$f":"IF(AND(BP142=26,$BN$4>=53,$BN$4<=60),\"Dbl.\"&BP142&\"E\",0)","v":{"$error":"#N/A"}},null,null,{"$error":"#N/A"},{"$error":"#N/A"},{"$f":"IF(AND(BU142=26,$BS$4>=53,$BS$4<=60),\"Dbl.\"&BU142&\"E\",0)","v":{"$error":"#N/A"}}]
[null,null,null,null,null,null,null,null,null,null,null,null,null,null,null,null,null,null,null,null,null,null,null,null,null,null,null,"Top Rail Reinf.",0,0,0,null,"Top Rail Reinf.",0,0,0,null,null,null,{"$error":"#N/A"},{"$error":"#N/A"},{"$f":"IF(AND(AO143=31,$AM$4>=13,$AM$4<=17.99),AO143&\"-\"&\"3\",0)","v":{"$error":"#N/A"}},null,null,{"$error":"#N/A"},{"$error":"#N/A"},{"$f":"IF(AND(AT143=31,$AR$4>=13,$AR$4<=17.99),AT143&\"-\"&\"3\",0)","v":{"$error":"#N/A"}},null,null,null,null,null,null,null,null,null,null,null,null,null,null,null,null,null,null,null,{"$error":"#N/A"},{"$error":"#N/A"},{"$f":"IF(AND(BP143=26,$BN$4>=61,$BN$4<=68),\"Dbl.\"&BP143&\"F\",0)","v":{"$error":"#N/A"}},null,null,{"$error":"#N/A"},{"$error":"#N/A"},{"$f":"IF(AND(BU143=26,$BS$4>=61,$BS$4<=68),\"Dbl.\"&BU143&\"F\",0)","v":{"$error":"#N/A"}}]
[null,null,null,null,null,null,null,null,null,null,null,null,null,null,null,null,null,null,null,null,null,null,null,null,null,null,null,"Top Stile Reinf",0,0,0,null,"Top Stile Reinf",0,0,0,null,null,null,{"$error":"#N/A"},{"$error":"#N/A"},{"$f":"IF(AND(AO144=31,$AM$4>=18,$AM$4<=23.99),AO144&\"-\"&\"4\",0)","v":{"$error":"#N/A"}},null,null,{"$error":"#N/A"},{"$error":"#N/A"},{"$f":"IF(AND(AT144=31,$AR$4>=18,$AR$4<=23.99),AT144&\"-\"&\"4\",0)","v":{"$error":"#N/A"}},null,null,null,null,null,null,null,null,null,null,null,null,null,null,null,null,null,null,null,{"$error":"#N/A"},{"$error":"#N/A"},{"$f":"IF(AND(BP144=26,$BN$4>=69,$BN$4<=76),\"Dbl.\"&BP144&\"G\",0)","v":{"$error":"#N/A"}},null,null,{"$error":"#N/A"},{"$error":"#N/A"},{"$f":"IF(AND(BU144=26,$BS$4>=69,$BS$4<=76),\"Dbl.\"&BU144&\"G\",0)","v":{"$error":"#N/A"}}]
[null,null,null,null,null,null,null,null,null,null,null,null,null,null,null,null,null,null,null,null,null,null,null,null,null,null,null,"Top Glass",0,0,0,null,"Top Glass",0,0,0,null,null,null,{"$error":"#N/A"},{"$error":"#N/A"},{"$f":"IF(AND(AO145=31,$AM$4>=24,$AM$4<=29.99),AO145&\"-\"&\"5\",0)","v":{"$error":"#N/A"}},null,null,{"$error":"#N/A"},{"$error":"#N/A"},{"$f":"IF(AND(AT145=31,$AR$4>=24,$AR$4<=29.99),AT145&\"-\"&\"5\",0)","v":{"$error":"#N/A"}},null,null,null,null,null,null,null,null,null,null,null,null,null,null,null,null,null,null,null,{"$error":"#N/A"},{"$error":"#N/A"},{"$f":"IF(AND(BP145=26,$BN$4>=77,$BN$4<=80),\"Dbl.\"&BP145&\"H\",0)","v":{"$error":"#N/A"}},null,null,{"$error":"#N/A"},{"$error":"#N/A"},{"$f":"IF(AND(BU145=26,$BS$4>=77,$BS$4<=80),\"Dbl.\"&BU145&\"H\",0)","v":{"$error":"#N/A"}}]
[null,null,null,null,null,null,null,null,null,null,null,null,null,null,null,null,null,null,null,null,null,null,null,null,null,null,null,"Top Spacer",0,0,0,null,"Top Spacer",0,0,0,null,null,null,{"$error":"#N/A"},{"$error":"#N/A"},{"$f":"IF(AND(AO146=31,$AM$4>=30,$AM$4<=34.99),AO146&\"-\"&\"6\",0)","v":{"$error":"#N/A"}},null,null,{"$error":"#N/A"},{"$error":"#N/A"},{"$f":"IF(AND(AT146=31,$AR$4>=30,$AR$4<=34.99),AT146&\"-\"&\"6\",0)","v":{"$error":"#N/A"}},null,null,null,null,null,null,null,null,null,null,null,null,null,null,null,null,null,null,null,{"$error":"#N/A"},{"$f":"IF(AND($BO$4<=28,$BO$4>26),28,0)","v":{"$error":"#N/A"}},{"$f":"IF(AND(BP146=28,$BN$4>=7,$BN$4<=12),BP146&\"A\",0)","v":{"$error":"#N/A"}},null,null,{"$error":"#N/A"},{"$f":"IF(AND($BT$4<=28,$BT$4>26),28,0)","v":{"$error":"#N/A"}},{"$f":"IF(AND(BU146=28,$BS$4>=7,$BS$4<=12),BU146&\"A\",0)","v":{"$error":"#N/A"}}]
[null,null,null,null,null,null,null,null,null,null,null,null,null,null,null,null,null,null,null,null,null,null,null,null,null,null,null,"Top Hardware",0,0,0,null,"Top Hardware",0,0,0,null,null,null,{"$error":"#N/A"},{"$error":"#N/A"},{"$f":"IF(AND(AO147=31,$AM$4>=35,$AM$4<=37.99),AO147&\"-\"&\"9\",0)","v":{"$error":"#N/A"}},null,null,{"$error":"#N/A"},{"$error":"#N/A"},{"$f":"IF(AND(AT147=31,$AR$4>=35,$AR$4<=37.99),AT147&\"-\"&\"9\",0)","v":{"$error":"#N/A"}},null,null,null,null,null,null,null,null,null,null,null,null,null,null,null,null,null,null,null,{"$error":"#N/A"},{"$error":"#N/A"},{"$f":"IF(AND(BP147=28,$BN$4>=13,$BN$4<=18),BP147&\"B\",0)","v":{"$error":"#N/A"}},null,null,{"$error":"#N/A"},{"$error":"#N/A"},{"$f":"IF(AND(BU147=28,$BS$4>=13,$BS$4<=18),BU147&\"B\",0)","v":{"$error":"#N/A"}}]
[null,null,null,null,null,null,null,null,null,null,null,null,null,null,null,null,null,null,null,null,null,null,null,null,null,null,null,"Top Bead",0,0,0,null,"Top Bead",0,0,0,null,null,null,{"$error":"#N/A"},{"$error":"#N/A"},{"$f":"IF(AND(AO148=31,$AM$4>=38,$AM$4<=40.99),AO148&\"-\"&\"12\",0)","v":{"$error":"#N/A"}},null,null,{"$error":"#N/A"},{"$error":"#N/A"},{"$f":"IF(AND(AT148=31,$AR$4>=38,$AR$4<=40.99),AT148&\"-\"&\"12\",0)","v":{"$error":"#N/A"}},null,null,null,null,null,null,null,null,null,null,null,null,null,null,null,null,null,null,null,{"$error":"#N/A"},{"$error":"#N/A"},{"$f":"IF(AND(BP148=28,$BN$4>=19,$BN$4<=23),BP148&\"C\",0)","v":{"$error":"#N/A"}},null,null,{"$error":"#N/A"},{"$error":"#N/A"},{"$f":"IF(AND(BU148=28,$BS$4>=19,$BS$4<=23),BU148&\"C\",0)","v":{"$error":"#N/A"}}]
[null,null,null,null,null,null,null,null,null,null,null,null,null,null,null,null,null,null,null,null,null,null,null,null,null,null,null,"Bottom Top Rail",{"$f":"Data!D816/12","v":-0.19270833333333334},0.24299999999999999,{"$f":"AC149*AD149","v":-4.6828124999999998E-2},null,"Bottom Top Rail",{"$f":"Data!D800/12","v":-0.19270833333333334},0.24299999999999999,{"$f":"AH149*AI149","v":-4.6828124999999998E-2},null,null,null,{"$error":"#N/A"},{"$error":"#N/A"},{"$f":"IF(AND(AO149=31,$AM$4>=41,$AM$4<=42.99),AO149&\"-\"&\"13\",0)","v":{"$error":"#N/A"}},null,null,{"$error":"#N/A"},{"$error":"#N/A"},{"$f":"IF(AND(AT149=31,$AR$4>=41,$AR$4<=42.99),AT149&\"-\"&\"13\",0)","v":{"$error":"#N/A"}},"x",null,null,null,null,null,null,null,null,null,null,null,null,null,null,null,null,null,null,{"$error":"#N/A"},{"$error":"#N/A"},{"$f":"IF(AND(BP149=28,$BN$4>=24,$BN$4<=28),BP149&\"D\",0)","v":{"$error":"#N/A"}},null,null,{"$error":"#N/A"},{"$error":"#N/A"},{"$f":"IF(AND(BU149=28,$BS$4>=24,$BS$4<=28),BU149&\"D\",0)","v":{"$error":"#N/A"}}]
[null,null,null,null,null,null,null,null,null,null,null,null,null,null,null,null,null,null,null,null,null,null,null,null,null,null,null,"Bottom Bottom Rail",{"$f":"Data!D816/12","v":-0.19270833333333334},0.216,-4.1625000000000002E-2,null,"Bottom Bottom Rail",{"$f":"Data!D800/12","v":-0.19270833333333334},0.216,-4.1625000000000002E-2,null,null,null,{"$error":"#N/A"},{"$error":"#N/A"},{"$f":"IF(AND(AO150=31,$AM$4>=43,$AM$4<=44.99),AO150&\"-\"&\"14\",0)","v":{"$error":"#N/A"}},null,null,{"$error":"#N/A"},{"$error":"#N/A"},{"$f":"IF(AND(AT150=31,$AR$4>=43,$AR$4<=44.99),AT150&\"-\"&\"14\",0)","v":{"$error":"#N/A"}},null,null,null,null,null,null,null,null,null,null,null,null,null,null,null,null,null,null,null,{"$error":"#N/A"},{"$error":"#N/A"},{"$f":"IF(AND(BP150=28,$BN$4>=29,$BN$4<=32),BP150&\"E\",0)","v":{"$error":"#N/A"}},null,null,{"$error":"#N/A"},{"$error":"#N/A"},{"$f":"IF(AND(BU150=28,$BS$4>=29,$BS$4<=32),BU150&\"E\",0)","v":{"$error":"#N/A"}}]
[null,null,null,null,null,null,null,null,null,null,null,null,null,null,null,null,null,null,null,null,null,null,null,null,null,null,null,"Bottom Stile",{"$f":"(Data!D817/12)*2","v":-0.23958333333333334},0.185,-4.432291666666667E-2,null,"Bottom Stile",{"$f":"(Data!D801/12)*2","v":-0.23958333333333334},0.185,-4.432291666666667E-2,null,null,null,{"$error":"#N/A"},{"$error":"#N/A"},{"$f":"IF(AND(AO151=31,$AM$4>=45,$AM$4<=47.99),AO151&\"-\"&\"15\",0)","v":{"$error":"#N/A"}},null,null,{"$error":"#N/A"},{"$error":"#N/A"},{"$f":"IF(AND(AT151=31,$AR$4>=45,$AR$4<=47.99),AT151&\"-\"&\"15\",0)","v":{"$error":"#N/A"}},null,null,null,null,null,null,null,null,null,null,null,null,null,null,null,null,null,null,null,{"$error":"#N/A"},{"$error":"#N/A"},{"$f":"IF(AND(BP151=28,$BN$4>=33,$BN$4<=36),BP151&\"F\",0)","v":{"$error":"#N/A"}},null,null,{"$error":"#N/A"},{"$error":"#N/A"},{"$f":"IF(AND(BU151=28,$BS$4>=33,$BS$4<=36),BU151&\"F\",0)","v":{"$error":"#N/A"}}]
[null,null,null,null,null,null,null,null,null,null,null,null,null,null,null,null,null,null,null,null,null,null,null,null,null,null,null,"Bottom Rail Reinf.",{"$f":"((AC149*12)-2.6875)/12","v":-0.41666666666666669},0.17199999999999999,-7.166666666666667E-2,null,"Bottom Rail Reinf.",{"$f":"((AH149*12)-2.6875)/12","v":-0.41666666666666669},0.17199999999999999,-7.166666666666667E-2,null,null,null,{"$error":"#N/A"},{"$error":"#N/A"},{"$f":"IF(AND(AO152=31,$AM$4>=48,$AM$4<=49.99),AO152&\"-\"&\"16\",0)","v":{"$error":"#N/A"}},null,null,{"$error":"#N/A"},{"$error":"#N/A"},{"$f":"IF(AND(AT152=31,$AR$4>=48,$AR$4<=49.99),AT152&\"-\"&\"16\",0)","v":{"$error":"#N/A"}},null,null,null,null,null,null,null,null,null,null,null,null,null,null,null,null,null,null,null,{"$error":"#N/A"},{"$error":"#N/A"},{"$f":"IF(AND(BP152=28,$BN$4>=37,$BN$4<=40),BP152&\"G\",0)","v":{"$error":"#N/A"}},null,null,{"$error":"#N/A"},{"$error":"#N/A"},{"$f":"IF(AND(BU152=28,$BS$4>=37,$BS$4<=40),BU152&\"G\",0)","v":{"$error":"#N/A"}}]
[null,null,null,null,null,null,null,null,null,null,null,null,null,null,null,null,null,null,null,null,null,null,null,null,null,null,null,"Bottom Stile Reinf.",null,null,0,null,"Bottom Stile Reinf.",null,null,0,null,null,null,{"$error":"#N/A"},{"$error":"#N/A"},{"$f":"IF(AND(AO153=31,$AM$4>=50,$AM$4<=52),AO153&\"-\"&\"17\",0)","v":{"$error":"#N/A"}},null,null,{"$error":"#N/A"},{"$error":"#N/A"},{"$f":"IF(AND(AT153=31,$AR$4>=50,$AR$4<=52),AT153&\"-\"&\"17\",0)","v":{"$error":"#N/A"}},null,null,null,null,null,null,null,null,null,null,null,null,null,null,null,null,null,null,null,{"$error":"#N/A"},{"$error":"#N/A"},{"$f":"IF(AND(BP153=28,$BN$4>=41,$BN$4<=43),BP153&\"H\",0)","v":{"$error":"#N/A"}},null,null,{"$error":"#N/A"},{"$error":"#N/A"},{"$f":"IF(AND(BU153=28,$BS$4>=41,$BS$4<=43),BU153&\"H\",0)","v":{"$error":"#N/A"}}]
[null,null,null,null,null,null,null,null,null,null,null,null,null,null,null,null,null,null,null,null,null,null,null,null,null,null,null,"Bottom Glass",{"$f":"(((AC149*12)-2.5625)*((AC151*12)-2.5))/144","v":0.18196614583333334},{"$f":"$H$10","v":2.3140000000000001},0.42106966145833336,null,"Bottom Glass",{"$f":"(((AH149*12)-2.5625)*((AH151*12)-2.5))/144","v":0.18196614583333334},{"$f":"$H$10","v":2.3140000000000001},0.42106966145833336,null,null,null,{"$f":"IF(AND(AO154>0,AP154>0),AO154,0)","v":{"$error":"#N/A"}},{"$f":"IF(AND($AN$4<=33,$AN$4>31),33,0)","v":{"$error":"#N/A"}},{"$f":"IF(AND(AO154=33,$AM$4>=6,$AM$4<=8.99),AO154&\"-\"&\"1\",0)","v":{"$error":"#N/A"}},null,null,{"$error":"#N/A"},{"$f":"IF(AND($AS$4<=33,$AS$4>31),33,0)","v":{"$error":"#N/A"}},{"$f":"IF(AND(AT154=33,$AR$4>=6,$AR$4<=8.99),AT154&\"-\"&\"1\",0)","v":{"$error":"#N/A"}},null,null,null,null,null,null,null,null,null,null,null,null,null,null,null,null,null,null,null,{"$error":"#N/A"},{"$error":"#N/A"},{"$f":"IF(AND(BP154=28,$BN$4>=44,$BN$4<=45),BP154&\"I\",0)","v":{"$error":"#N/A"}},null,null,{"$error":"#N/A"},{"$error":"#N/A"},{"$f":"IF(AND(BU154=28,$BS$4>=44,$BS$4<=45),BU154&\"I\",0)","v":{"$error":"#N/A"}}]
[null,null,null,null,null,null,null,null,null,null,null,null,null,null,null,null,null,null,null,null,null,null,null,null,null,null,null,"Bottom Spacer",{"$f":"(((AC149*12)*2)+((AC151*12)*2))/12","v":-0.86458333333333337},5.3600000000000002E-2,{"$f":"AC155*AD155","v":-4.634166666666667E-2},null,"Bottom Spacer",{"$f":"(((AH149*12)*2)+((AH151*12)*2))/12","v":-0.86458333333333337},5.3600000000000002E-2,{"$f":"AH155*AI155","v":-4.634166666666667E-2},null,null,null,{"$error":"#N/A"},{"$error":"#N/A"},{"$f":"IF(AND(AO155=33,$AM$4>=9,$AM$4<=12.99),AO155&\"-\"&\"2\",0)","v":{"$error":"#N/A"}},null,null,{"$error":"#N/A"},{"$error":"#N/A"},{"$f":"IF(AND(AT155=33,$AR$4>=9,$AR$4<=12.99),AT155&\"-\"&\"2\",0)","v":{"$error":"#N/A"}},null,null,null,null,null,null,null,null,null,null,null,null,null,null,null,null,null,null,null,{"$error":"#N/A"},{"$error":"#N/A"},{"$f":"IF(AND(BP155=28,$BN$4=46),\"Dbl.\"&BP155&\"C\",0)","v":{"$error":"#N/A"}},null,null,{"$error":"#N/A"},{"$error":"#N/A"},{"$f":"IF(AND(BU155=28,$BS$4=46),\"Dbl.\"&BU155&\"C\",0)","v":{"$error":"#N/A"}}]
[null,null,null,null,null,null,null,null,null,null,null,null,null,null,null,null,null,null,null,null,null,null,null,null,null,null,null,"Bottom Hardware",1,0.36,{"$f":"AC156*AD156","v":0.36},null,"Bottom Hardware",1,0.36,{"$f":"AH156*AI156","v":0.36},null,null,null,{"$error":"#N/A"},{"$error":"#N/A"},{"$f":"IF(AND(AO156=33,$AM$4>=13,$AM$4<=17.99),AO156&\"-\"&\"3\",0)","v":{"$error":"#N/A"}},null,null,{"$error":"#N/A"},{"$error":"#N/A"},{"$f":"IF(AND(AT156=33,$AR$4>=13,$AR$4<=17.99),AT156&\"-\"&\"3\",0)","v":{"$error":"#N/A"}},null,null,null,null,null,null,null,null,null,null,null,null,null,null,null,null,null,null,null,{"$error":"#N/A"},{"$error":"#N/A"},{"$f":"IF(AND(BP156=28,$BN$4>=47,$BN$4<=56),\"Dbl.\"&BP156&\"D\",0)","v":{"$error":"#N/A"}},null,null,{"$error":"#N/A"},{"$error":"#N/A"},{"$f":"IF(AND(BU156=28,$BS$4>=47,$BS$4<=56),\"Dbl.\"&BU156&\"D\",0)","v":{"$error":"#N/A"}}]
[null,null,null,null,null,null,null,null,null,null,null,null,null,null,null,null,null,null,null,null,null,null,null,null,null,null,null,"Bottom Bead",{"$f":"((((AC149*12)-2.25)*2)+(((AC151*12)-2.25)*2))/12","v":-1.6145833333333333},1.9E-2,{"$f":"AC157*AD157","v":-3.0677083333333331E-2},null,"Bottom Bead",{"$f":"((((AH149*12)-2.25)*2)+(((AH151*12)-2.25)*2))/12","v":-1.6145833333333333},1.9E-2,{"$f":"AH157*AI157","v":-3.0677083333333331E-2},null,null,null,{"$error":"#N/A"},{"$error":"#N/A"},{"$f":"IF(AND(AO157=33,$AM$4>=18,$AM$4<=23.99),AO157&\"-\"&\"4\",0)","v":{"$error":"#N/A"}},null,null,{"$error":"#N/A"},{"$error":"#N/A"},{"$f":"IF(AND(AT157=33,$AR$4>=18,$AR$4<=23.99),AT157&\"-\"&\"4\",0)","v":{"$error":"#N/A"}},null,null,null,null,null,null,null,null,null,null,null,null,null,null,null,null,null,null,null,{"$error":"#N/A"},{"$error":"#N/A"},{"$f":"IF(AND(BP157=28,$BN$4>=57,$BN$4<=64),\"Dbl.\"&BP157&\"E\",0)","v":{"$error":"#N/A"}},null,null,{"$error":"#N/A"},{"$error":"#N/A"},{"$f":"IF(AND(BU157=28,$BS$4>=57,$BS$4<=64),\"Dbl.\"&BU157&\"E\",0)","v":{"$error":"#N/A"}}]
[null,null,null,null,null,null,null,null,null,null,null,null,null,null,null,null,null,null,null,null,null,null,null,null,null,null,null,null,null,"Top Sash",0,null,null,null,"Top Sash",0,null,null,null,{"$error":"#N/A"},{"$error":"#N/A"},{"$f":"IF(AND(AO158=33,$AM$4>=24,$AM$4<=29.99),AO158&\"-\"&\"5\",0)","v":{"$error":"#N/A"}},null,null,{"$error":"#N/A"},{"$error":"#N/A"},{"$f":"IF(AND(AT158=33,$AR$4>=24,$AR$4<=29.99),AT158&\"-\"&\"5\",0)","v":{"$error":"#N/A"}},null,null,null,null,null,null,null,null,null,null,null,null,null,null,null,null,null,null,null,{"$error":"#N/A"},{"$error":"#N/A"},{"$f":"IF(AND(BP158=28,$BN$4>=65,$BN$4<=72),\"Dbl.\"&BP158&\"F\",0)","v":{"$error":"#N/A"}},null,null,{"$error":"#N/A"},{"$error":"#N/A"},{"$f":"IF(AND(BU158=28,$BS$4>=65,$BS$4<=72),\"Dbl.\"&BU158&\"F\",0)","v":{"$error":"#N/A"}}]
[null,null,null,null,null,null,null,null,null,null,null,null,null,null,null,null,null,null,null,null,null,null,null,null,null,null,null,null,null,"Bottom Sash",{"$f":"IF(ModelNo=\"8SPS\",TRUNC(SUM(AE149:AE157)),0)","v":0},null,null,null,"Bottom Sash",{"$f":"IF(ModelNo=\"82SP\",TRUNC(SUM(AJ149:AJ157)),0)","v":0},null,null,null,{"$error":"#N/A"},{"$error":"#N/A"},{"$f":"IF(AND(AO159=33,$AM$4>=30,$AM$4<=34.99),AO159&\"-\"&\"6\",0)","v":{"$error":"#N/A"}},null,null,{"$error":"#N/A"},{"$error":"#N/A"},{"$f":"IF(AND(AT159=33,$AR$4>=30,$AR$4<=34.99),AT159&\"-\"&\"6\",0)","v":{"$error":"#N/A"}},null,null,null,null,null,null,null,null,null,null,null,null,null,null,null,null,null,null,null,{"$error":"#N/A"},{"$error":"#N/A"},{"$f":"IF(AND(BP159=28,$BN$4>=73,$BN$4<=80),\"Dbl.\"&BP159&\"G\",0)","v":{"$error":"#N/A"}},null,null,{"$error":"#N/A"},{"$error":"#N/A"},{"$f":"IF(AND(BU159=28,$BS$4>=73,$BS$4<=80),\"Dbl.\"&BU159&\"G\",0)","v":{"$error":"#N/A"}}]
[null,null,null,null,null,null,null,null,null,null,null,null,null,null,null,null,null,null,null,null,null,null,null,null,null,null,null,null,null,null,null,null,null,null,null,null,null,null,null,{"$error":"#N/A"},{"$error":"#N/A"},{"$f":"IF(AND(AO160=33,$AM$4>=35,$AM$4<=37.99),AO160&\"-\"&\"9\",0)","v":{"$error":"#N/A"}},null,null,{"$error":"#N/A"},{"$error":"#N/A"},{"$f":"IF(AND(AT160=33,$AR$4>=35,$AR$4<=37.99),AT160&\"-\"&\"9\",0)","v":{"$error":"#N/A"}},null,null,null,null,null,null,null,null,null,null,null,null,null,null,null,null,null,null,null,{"$error":"#N/A"},{"$f":"IF(AND($BO$4<=30,$BO$4>28),30,0)","v":{"$error":"#N/A"}},{"$f":"IF(AND(BP160=30,$BN$4>=8,$BN$4<=13),BP160&\"A\",0)","v":{"$error":"#N/A"}},null,null,{"$error":"#N/A"},{"$f":"IF(AND($BT$4<=30,$BT$4>28),30,0)","v":{"$error":"#N/A"}},{"$f":"IF(AND(BU160=30,$BS$4>=8,$BS$4<=13),BU160&\"A\",0)","v":{"$error":"#N/A"}}]
[null,null,null,null,null,null,null,null,null,null,null,null,null,null,null,null,null,null,null,null,null,null,null,null,null,null,null,"8SPP","Length","Weight/ft","Weight",null,"8POS","Length","Weight/ft","Weight",null,null,null,{"$error":"#N/A"},{"$error":"#N/A"},{"$f":"IF(AND(AO161=33,$AM$4>=38,$AM$4<=40.99),AO161&\"-\"&\"12\",0)","v":{"$error":"#N/A"}},null,null,{"$error":"#N/A"},{"$error":"#N/A"},{"$f":"IF(AND(AT161=33,$AR$4>=38,$AR$4<=40.99),AT161&\"-\"&\"12\",0)","v":{"$error":"#N/A"}},null,null,null,null,null,null,null,null,null,null,null,null,null,null,null,null,null,null,null,{"$error":"#N/A"},{"$error":"#N/A"},{"$f":"IF(AND(BP161=30,$BN$4>=14,$BN$4<=19),BP161&\"B\",0)","v":{"$error":"#N/A"}},null,null,{"$error":"#N/A"},{"$error":"#N/A"},{"$f":"IF(AND(BU161=30,$BS$4>=14,$BS$4<=19),BU161&\"B\",0)","v":{"$error":"#N/A"}}]
[null,null,null,null,null,null,null,null,null,null,null,null,null,null,null,null,null,null,null,null,null,null,null,null,null,null,null,"Top Top Rail",0,0,{"$f":"AC162*AD162","v":0},null,"Top Top Rail",0,0,{"$f":"AH162*AI162","v":0},null,null,null,{"$error":"#N/A"},{"$error":"#N/A"},{"$f":"IF(AND(AO162=33,$AM$4>=41,$AM$4<=42.99),AO162&\"-\"&\"13\",0)","v":{"$error":"#N/A"}},null,null,{"$error":"#N/A"},{"$error":"#N/A"},{"$f":"IF(AND(AT162=33,$AR$4>=41,$AR$4<=42.99),AT162&\"-\"&\"13\",0)","v":{"$error":"#N/A"}},null,null,null,null,null,null,null,null,null,null,null,null,null,null,null,null,null,null,null,{"$error":"#N/A"},{"$error":"#N/A"},{"$f":"IF(AND(BP162=30,$BN$4>=20,$BN$4<=24),BP162&\"C\",0)","v":{"$error":"#N/A"}},null,null,{"$error":"#N/A"},{"$error":"#N/A"},{"$f":"IF(AND(BU162=30,$BS$4>=20,$BS$4<=24),BU162&\"C\",0)","v":{"$error":"#N/A"}}]
[null,null,null,null,null,null,null,null,null,null,null,null,null,null,null,null,null,null,null,null,null,null,null,null,null,null,null,"Top Bottom Rail",0,0,{"$f":"AC163*AD163","v":0},null,"Top Bottom Rail",0,0,{"$f":"AH163*AI163","v":0},null,null,null,{"$error":"#N/A"},{"$error":"#N/A"},{"$f":"IF(AND(AO163=33,$AM$4>=43,$AM$4<=44.99),AO163&\"-\"&\"14\",0)","v":{"$error":"#N/A"}},null,null,{"$error":"#N/A"},{"$error":"#N/A"},{"$f":"IF(AND(AT163=33,$AR$4>=43,$AR$4<=44.99),AT163&\"-\"&\"14\",0)","v":{"$error":"#N/A"}},"x",null,null,null,null,null,null,null,null,null,null,null,null,null,null,null,null,null,null,{"$error":"#N/A"},{"$error":"#N/A"},{"$f":"IF(AND(BP163=30,$BN$4>=25,$BN$4<=29),BP163&\"D\",0)","v":{"$error":"#N/A"}},null,null,{"$error":"#N/A"},{"$error":"#N/A"},{"$f":"IF(AND(BU163=30,$BS$4>=25,$BS$4<=29),BU163&\"D\",0)","v":{"$error":"#N/A"}}]
[null,null,null,null,null,null,null,null,null,null,null,null,null,null,null,null,null,null,null,null,null,null,null,null,null,null,null,"Top Stile",0,0,{"$f":"(AC164*AD164)/12","v":0},null,"Top Stile",0,0,{"$f":"(AH164*AI164)/12","v":0},null,null,null,{"$error":"#N/A"},{"$error":"#N/A"},{"$f":"IF(AND(AO164=33,$AM$4>=45,$AM$4<=47.99),AO164&\"-\"&\"15\",0)","v":{"$error":"#N/A"}},null,null,{"$error":"#N/A"},{"$error":"#N/A"},{"$f":"IF(AND(AT164=33,$AR$4>=45,$AR$4<=47.99),AT164&\"-\"&\"15\",0)","v":{"$error":"#N/A"}},null,null,null,null,null,null,null,null,null,null,null,null,null,null,null,null,null,null,null,{"$error":"#N/A"},{"$error":"#N/A"},{"$f":"IF(AND(BP164=30,$BN$4>=30,$BN$4<=33),BP164&\"E\",0)","v":{"$error":"#N/A"}},null,null,{"$error":"#N/A"},{"$error":"#N/A"},{"$f":"IF(AND(BU164=30,$BS$4>=30,$BS$4<=33),BU164&\"E\",0)","v":{"$error":"#N/A"}}]
[null,null,null,null,null,null,null,null,null,null,null,null,null,null,null,null,null,null,null,null,null,null,null,null,null,null,null,"Top Rail Reinf.",0,0,0,null,"Top Rail Reinf.",0,0,0,null,null,null,{"$error":"#N/A"},{"$error":"#N/A"},{"$f":"IF(AND(AO165=33,$AM$4>=48,$AM$4<=49.99),AO165&\"-\"&\"16\",0)","v":{"$error":"#N/A"}},null,null,{"$error":"#N/A"},{"$error":"#N/A"},{"$f":"IF(AND(AT165=33,$AR$4>=48,$AR$4<=49.99),AT165&\"-\"&\"16\",0)","v":{"$error":"#N/A"}},null,null,null,null,null,null,null,null,null,null,null,null,null,null,null,null,null,null,null,{"$error":"#N/A"},{"$error":"#N/A"},{"$f":"IF(AND(BP165=30,$BN$4>=34,$BN$4<=37),BP165&\"F\",0)","v":{"$error":"#N/A"}},null,null,{"$error":"#N/A"},{"$error":"#N/A"},{"$f":"IF(AND(BU165=30,$BS$4>=34,$BS$4<=37),BU165&\"F\",0)","v":{"$error":"#N/A"}}]
[null,null,null,null,null,null,null,null,null,null,null,null,null,null,null,null,null,null,null,null,null,null,null,null,null,null,null,"Top Stile Reinf",0,0,0,null,"Top Stile Reinf",0,0,0,null,null,null,{"$error":"#N/A"},{"$error":"#N/A"},{"$f":"IF(AND(AO166=33,$AM$4>=50,$AM$4<=52),AO166&\"-\"&\"17\",0)","v":{"$error":"#N/A"}},null,null,{"$error":"#N/A"},{"$error":"#N/A"},{"$f":"IF(AND(AT166=33,$AR$4>=50,$AR$4<=52),AT166&\"-\"&\"17\",0)","v":{"$error":"#N/A"}},null,null,null,null,null,null,null,null,null,null,null,null,null,null,null,null,null,null,null,{"$error":"#N/A"},{"$error":"#N/A"},{"$f":"IF(AND(BP166=30,$BN$4>=38,$BN$4<=40),BP166&\"G\",0)","v":{"$error":"#N/A"}},null,null,{"$error":"#N/A"},{"$error":"#N/A"},{"$f":"IF(AND(BU166=30,$BS$4>=38,$BS$4<=40),BU166&\"G\",0)","v":{"$error":"#N/A"}}]
[null,null,null,null,null,null,null,null,null,null,null,null,null,null,null,null,null,null,null,null,null,null,null,null,null,null,null,"Top Glass",0,0,0,null,"Top Glass",0,0,0,null,null,null,{"$f":"IF(AND(AO167>0,AP167>0),AO167,0)","v":{"$error":"#N/A"}},{"$f":"IF(AND($AN$4<=35,$AN$4>33),35,0)","v":{"$error":"#N/A"}},{"$f":"IF(AND(AO167=35,$AM$4>=8,$AM$4<=11.99),AO167&\"-\"&\"1\",0)","v":{"$error":"#N/A"}},null,null,{"$error":"#N/A"},{"$f":"IF(AND($AS$4<=35,$AS$4>33),35,0)","v":{"$error":"#N/A"}},{"$f":"IF(AND(AT167=35,$AR$4>=8,$AR$4<=11.99),AT167&\"-\"&\"1\",0)","v":{"$error":"#N/A"}},null,null,null,null,null,null,null,null,null,null,null,null,null,null,null,null,null,null,null,{"$error":"#N/A"},{"$error":"#N/A"},{"$f":"IF(AND(BP167=30,$BN$4>=41,$BN$4<=43),BP167&\"H\",0)","v":{"$error":"#N/A"}},null,null,{"$error":"#N/A"},{"$error":"#N/A"},{"$f":"IF(AND(BU167=30,$BS$4>=41,$BS$4<=43),BU167&\"H\",0)","v":{"$error":"#N/A"}}]
[null,null,null,null,null,null,null,null,null,null,null,null,null,null,null,null,null,null,null,null,null,null,null,null,null,null,null,"Top Spacer",0,0,0,null,"Top Spacer",0,0,0,null,null,null,{"$error":"#N/A"},{"$error":"#N/A"},{"$f":"IF(AND(AO168=35,$AM$4>=12,$AM$4<=16.99),AO168&\"-\"&\"2\",0)","v":{"$error":"#N/A"}},null,null,{"$error":"#N/A"},{"$error":"#N/A"},{"$f":"IF(AND(AT168=35,$AR$4>=12,$AR$4<=16.99),AT168&\"-\"&\"2\",0)","v":{"$error":"#N/A"}},null,null,null,null,null,null,null,null,null,null,null,null,null,null,null,null,null,null,null,{"$error":"#N/A"},{"$error":"#N/A"},{"$f":"IF(AND(BP168=30,$BN$4>=44,$BN$4<=45),BP168&\"I\",0)","v":{"$error":"#N/A"}},null,null,{"$error":"#N/A"},{"$error":"#N/A"},{"$f":"IF(AND(BU168=30,$BS$4>=44,$BS$4<=45),BU168&\"I\",0)","v":{"$error":"#N/A"}}]
[null,null,null,null,null,null,null,null,null,null,null,null,null,null,null,null,null,null,null,null,null,null,null,null,null,null,null,"Top Hardware",0,0,0,null,"Top Hardware",0,0,0,null,null,null,{"$error":"#N/A"},{"$error":"#N/A"},{"$f":"IF(AND(AO169=35,$AM$4>=17,$AM$4<=22.99),AO169&\"-\"&\"3\",0)","v":{"$error":"#N/A"}},null,null,{"$error":"#N/A"},{"$error":"#N/A"},{"$f":"IF(AND(AT169=35,$AR$4>=17,$AR$4<=22.99),AT169&\"-\"&\"3\",0)","v":{"$error":"#N/A"}},null,null,null,null,null,null,null,null,null,null,null,null,null,null,null,null,null,null,null,{"$error":"#N/A"},{"$error":"#N/A"},{"$f":"IF(AND(BP169=30,$BN$4>=46,$BN$4<=48),\"Dbl.\"&BP169&\"C\",0)","v":{"$error":"#N/A"}},null,null,{"$error":"#N/A"},{"$error":"#N/A"},{"$f":"IF(AND(BU169=30,$BS$4>=46,$BS$4<=48),\"Dbl.\"&BU169&\"C\",0)","v":{"$error":"#N/A"}}]
[null,null,null,null,null,null,null,null,null,null,null,null,null,null,null,null,null,null,null,null,null,null,null,null,null,null,null,"Top Bead",0,0,0,null,"Top Bead",0,0,0,null,null,null,{"$error":"#N/A"},{"$error":"#N/A"},{"$f":"IF(AND(AO170=35,$AM$4>=23,$AM$4<=28.99),AO170&\"-\"&\"4\",0)","v":{"$error":"#N/A"}},null,null,{"$error":"#N/A"},{"$error":"#N/A"},{"$f":"IF(AND(AT170=35,$AR$4>=23,$AR$4<=28.99),AT170&\"-\"&\"4\",0)","v":{"$error":"#N/A"}},null,null,null,null,null,null,null,null,null,null,null,null,null,null,null,null,null,null,null,{"$error":"#N/A"},{"$error":"#N/A"},{"$f":"IF(AND(BP170=30,$BN$4>=49,$BN$4<=58),\"Dbl.\"&BP170&\"D\",0)","v":{"$error":"#N/A"}},null,null,{"$error":"#N/A"},{"$error":"#N/A"},{"$f":"IF(AND(BU170=30,$BS$4>=49,$BS$4<=58),\"Dbl.\"&BU170&\"D\",0)","v":{"$error":"#N/A"}}]
[null,null,null,null,null,null,null,null,null,null,null,null,null,null,null,null,null,null,null,null,null,null,null,null,null,null,null,"Bottom Top Rail",{"$f":"Data!D832/12","v":-0.19270833333333334},0.24299999999999999,{"$f":"AC171*AD171","v":-4.6828124999999998E-2},null,"Bottom Top Rail",{"$f":"Data!D850/12","v":-0.22916666666666666},0.24299999999999999,{"$f":"AH171*AI171","v":-5.5687499999999994E-2},null,null,null,{"$error":"#N/A"},{"$error":"#N/A"},{"$f":"IF(AND(AO171=35,$AM$4>=29,$AM$4<=33.99),AO171&\"-\"&\"5\",0)","v":{"$error":"#N/A"}},null,null,{"$error":"#N/A"},{"$error":"#N/A"},{"$f":"IF(AND(AT171=35,$AR$4>=29,$AR$4<=33.99),AT171&\"-\"&\"5\",0)","v":{"$error":"#N/A"}},null,null,null,null,null,null,null,null,null,null,null,null,null,null,null,null,null,null,null,{"$error":"#N/A"},{"$error":"#N/A"},{"$f":"IF(AND(BP171=30,$BN$4>=59,$BN$4<=66),\"Dbl.\"&BP171&\"E\",0)","v":{"$error":"#N/A"}},null,null,{"$error":"#N/A"},{"$error":"#N/A"},{"$f":"IF(AND(BU171=30,$BS$4>=59,$BS$4<=66),\"Dbl.\"&BU171&\"E\",0)","v":{"$error":"#N/A"}}]
[null,null,null,null,null,null,null,null,null,null,null,null,null,null,null,null,null,null,null,null,null,null,null,null,null,null,null,"Bottom Bottom Rail",{"$f":"Data!D832/12","v":-0.19270833333333334},0.216,-4.1625000000000002E-2,null,"Bottom Bottom Rail",{"$f":"Data!D851/12","v":-0.10416666666666667},0.216,-2.2499999999999999E-2,null,null,null,{"$error":"#N/A"},{"$error":"#N/A"},{"$f":"IF(AND(AO172=35,$AM$4>=34,$AM$4<=37.99),AO172&\"-\"&\"6\",0)","v":{"$error":"#N/A"}},null,null,{"$error":"#N/A"},{"$error":"#N/A"},{"$f":"IF(AND(AT172=35,$AR$4>=34,$AR$4<=37.99),AT172&\"-\"&\"6\",0)","v":{"$error":"#N/A"}},null,null,null,null,null,null,null,null,null,null,null,null,null,null,null,null,null,null,null,{"$error":"#N/A"},{"$error":"#N/A"},{"$f":"IF(AND(BP172=30,$BN$4>=67,$BN$4<=74),\"Dbl.\"&BP172&\"F\",0)","v":{"$error":"#N/A"}},null,null,{"$error":"#N/A"},{"$error":"#N/A"},{"$f":"IF(AND(BU172=30,$BS$4>=67,$BS$4<=74),\"Dbl.\"&BU172&\"F\",0)","v":{"$error":"#N/A"}}]
[null,null,null,null,null,null,null,null,null,null,null,null,null,null,null,null,null,null,null,null,null,null,null,null,null,null,null,"Bottom Stile",{"$f":"(Data!D833/12)*2","v":-0.20833333333333334},0.185,-3.8541666666666669E-2,null,"Bottom Stile",{"$f":"(Data!D851/12)*2","v":-0.20833333333333334},0.185,-3.8541666666666669E-2,null,null,null,{"$error":"#N/A"},{"$error":"#N/A"},{"$f":"IF(AND(AO173=35,$AM$4>=38,$AM$4<=39.99),AO173&\"-\"&\"9\",0)","v":{"$error":"#N/A"}},null,null,{"$error":"#N/A"},{"$error":"#N/A"},{"$f":"IF(AND(AT173=35,$AR$4>=38,$AR$4<=39.99),AT173&\"-\"&\"9\",0)","v":{"$error":"#N/A"}},null,null,null,null,null,null,null,null,null,null,null,null,null,null,null,null,null,null,null,{"$error":"#N/A"},{"$error":"#N/A"},{"$f":"IF(AND(BP173=30,$BN$4>=75,$BN$4<=80),\"Dbl.\"&BP173&\"G\",0)","v":{"$error":"#N/A"}},null,null,{"$error":"#N/A"},{"$error":"#N/A"},{"$f":"IF(AND(BU173=30,$BS$4>=75,$BS$4<=80),\"Dbl.\"&BU173&\"G\",0)","v":{"$error":"#N/A"}}]
[null,null,null,null,null,null,null,null,null,null,null,null,null,null,null,null,null,null,null,null,null,null,null,null,null,null,null,"Bottom Rail Reinf.",{"$f":"((AC171*12)-2.6875)/12","v":-0.41666666666666669},0.17199999999999999,-7.166666666666667E-2,null,"Bottom Rail Reinf.",{"$f":"((AH171*12)-2.6875)/12","v":-0.453125},0.17199999999999999,-7.7937499999999993E-2,null,null,null,{"$error":"#N/A"},{"$error":"#N/A"},{"$f":"IF(AND(AO174=35,$AM$4>=40,$AM$4<=42.99),AO174&\"-\"&\"12\",0)","v":{"$error":"#N/A"}},null,null,{"$error":"#N/A"},{"$error":"#N/A"},{"$f":"IF(AND(AT174=35,$AR$4>=40,$AR$4<=42.99),AT174&\"-\"&\"12\",0)","v":{"$error":"#N/A"}},null,null,null,null,null,null,null,null,null,null,null,null,null,null,null,null,null,null,null,{"$error":"#N/A"},{"$f":"IF(AND($BO$4<=32,$BO$4>30),32,0)","v":{"$error":"#N/A"}},{"$f":"IF(AND(BP174=32,$BN$4>=8,$BN$4<=14),BP174&\"A\",0)","v":{"$error":"#N/A"}},null,null,{"$error":"#N/A"},{"$f":"IF(AND($BT$4<=32,$BT$4>30),32,0)","v":{"$error":"#N/A"}},{"$f":"IF(AND(BU174=32,$BS$4>=8,$BS$4<=14),BU174&\"A\",0)","v":{"$error":"#N/A"}}]
[null,null,null,null,null,null,null,null,null,null,null,null,null,null,null,null,null,null,null,null,null,null,null,null,null,null,null,"Bottom Stile Reinf.",null,null,0,null,"Bottom Stile Reinf.",null,null,0,null,null,null,{"$error":"#N/A"},{"$error":"#N/A"},{"$f":"IF(AND(AO175=35,$AM$4>=43,$AM$4<=44.99),AO175&\"-\"&\"13\",0)","v":{"$error":"#N/A"}},null,null,{"$error":"#N/A"},{"$error":"#N/A"},{"$f":"IF(AND(AT175=35,$AR$4>=43,$AR$4<=44.99),AT175&\"-\"&\"13\",0)","v":{"$error":"#N/A"}},"x",null,null,null,null,null,null,null,null,null,null,null,null,null,null,null,null,null,null,{"$error":"#N/A"},{"$error":"#N/A"},{"$f":"IF(AND(BP175=32,$BN$4>=15,$BN$4<=20),BP175&\"B\",0)","v":{"$error":"#N/A"}},null,null,{"$error":"#N/A"},{"$error":"#N/A"},{"$f":"IF(AND(BU175=32,$BS$4>=15,$BS$4<=20),BU175&\"B\",0)","v":{"$error":"#N/A"}}]
[null,null,null,null,null,null,null,null,null,null,null,null,null,null,null,null,null,null,null,null,null,null,null,null,null,null,null,"Bottom Glass",{"$f":"(((AC171*12)-2.5625)*((AC173*12)-2.5))/144","v":0.16927083333333334},{"$f":"$H$10","v":2.3140000000000001},0.39169270833333336,null,"Bottom Glass",{"$f":"(((AH171*12)-2.5625)*((AH173*12)-2.5))/144","v":0.18446180555555555},{"$f":"$H$10","v":2.3140000000000001},0.42684461805555557,null,null,null,{"$error":"#N/A"},{"$error":"#N/A"},{"$f":"IF(AND(AO176=35,$AM$4>=45,$AM$4<=47.99),AO176&\"-\"&\"14\",0)","v":{"$error":"#N/A"}},null,null,{"$error":"#N/A"},{"$error":"#N/A"},{"$f":"IF(AND(AT176=35,$AR$4>=45,$AR$4<=47.99),AT176&\"-\"&\"14\",0)","v":{"$error":"#N/A"}},null,null,null,null,null,null,null,null,null,null,null,null,null,null,null,null,null,null,null,{"$error":"#N/A"},{"$error":"#N/A"},{"$f":"IF(AND(BP176=32,$BN$4>=21,$BN$4<=25),BP176&\"C\",0)","v":{"$error":"#N/A"}},null,null,{"$error":"#N/A"},{"$error":"#N/A"},{"$f":"IF(AND(BU176=32,$BS$4>=21,$BS$4<=25),BU176&\"C\",0)","v":{"$error":"#N/A"}}]
[null,null,null,null,null,null,null,null,null,null,null,null,null,null,null,null,null,null,null,null,null,null,null,null,null,null,null,"Bottom Spacer",{"$f":"(((AC171*12)*2)+((AC173*12)*2))/12","v":-0.80208333333333337},5.3600000000000002E-2,{"$f":"AC177*AD177","v":-4.2991666666666671E-2},null,"Bottom Spacer",{"$f":"(((AH171*12)*2)+((AH173*12)*2))/12","v":-0.875},5.3600000000000002E-2,{"$f":"AH177*AI177","v":-4.6900000000000004E-2},null,null,null,{"$error":"#N/A"},{"$error":"#N/A"},{"$f":"IF(AND(AO177=35,$AM$4>=48,$AM$4<=50.99),AO177&\"-\"&\"15\",0)","v":{"$error":"#N/A"}},null,null,{"$error":"#N/A"},{"$error":"#N/A"},{"$f":"IF(AND(AT177=35,$AR$4>=48,$AR$4<=50.99),AT177&\"-\"&\"15\",0)","v":{"$error":"#N/A"}},null,null,null,null,null,null,null,null,null,null,null,null,null,null,null,null,null,null,null,{"$error":"#N/A"},{"$error":"#N/A"},{"$f":"IF(AND(BP177=32,$BN$4>=26,$BN$4<=30),BP177&\"D\",0)","v":{"$error":"#N/A"}},null,null,{"$error":"#N/A"},{"$error":"#N/A"},{"$f":"IF(AND(BU177=32,$BS$4>=26,$BS$4<=30),BU177&\"D\",0)","v":{"$error":"#N/A"}}]
[null,null,null,null,null,null,null,null,null,null,null,null,null,null,null,null,null,null,null,null,null,null,null,null,null,null,null,"Bottom Hardware",1,0.36,{"$f":"AC178*AD178","v":0.36},null,"Bottom Hardware",1,0.36,{"$f":"AH178*AI178","v":0.36},null,null,null,{"$error":"#N/A"},{"$error":"#N/A"},{"$f":"IF(AND(AO178=35,$AM$4>=51,$AM$4<=53),AO178&\"-\"&\"16\",0)","v":{"$error":"#N/A"}},null,null,{"$error":"#N/A"},{"$error":"#N/A"},{"$f":"IF(AND(AT178=35,$AR$4>=51,$AR$4<=53),AT178&\"-\"&\"16\",0)","v":{"$error":"#N/A"}},null,null,null,null,null,null,null,null,null,null,null,null,null,null,null,null,null,null,null,{"$error":"#N/A"},{"$error":"#N/A"},{"$f":"IF(AND(BP178=32,$BN$4>=31,$BN$4<=34),BP178&\"E\",0)","v":{"$error":"#N/A"}},null,null,{"$error":"#N/A"},{"$error":"#N/A"},{"$f":"IF(AND(BU178=32,$BS$4>=31,$BS$4<=34),BU178&\"E\",0)","v":{"$error":"#N/A"}}]
[null,null,null,null,null,null,null,null,null,null,null,null,null,null,null,null,null,null,null,null,null,null,null,null,null,null,null,"Bottom Bead",{"$f":"((((AC171*12)-2.25)*2)+(((AC173*12)-2.25)*2))/12","v":-1.5520833333333333},1.9E-2,{"$f":"AC179*AD179","v":-2.9489583333333333E-2},null,"Bottom Bead",{"$f":"((((AH171*12)-2.25)*2)+(((AH173*12)-2.25)*2))/12","v":-1.625},1.9E-2,{"$f":"AH179*AI179","v":-3.0875E-2},null,null,null,{"$f":"IF(AND(AO179>0,AP179>0),AO179,0)","v":{"$error":"#N/A"}},{"$f":"IF(AND($AN$4<=37,$AN$4>35),37,0)","v":{"$error":"#N/A"}},{"$f":"IF(AND(AO179=37,$AM$4>=8,$AM$4<=11.99),AO179&\"-\"&\"1\",0)","v":{"$error":"#N/A"}},null,null,{"$error":"#N/A"},{"$f":"IF(AND($AS$4<=37,$AS$4>35),37,0)","v":{"$error":"#N/A"}},{"$f":"IF(AND(AT179=37,$AR$4>=8,$AR$4<=11.99),AT179&\"-\"&\"1\",0)","v":{"$error":"#N/A"}},null,null,null,null,null,null,null,null,null,null,null,null,null,null,null,null,null,null,null,{"$error":"#N/A"},{"$error":"#N/A"},{"$f":"IF(AND(BP179=32,$BN$4>=35,$BN$4<=37),BP179&\"F\",0)","v":{"$error":"#N/A"}},null,null,{"$error":"#N/A"},{"$error":"#N/A"},{"$f":"IF(AND(BU179=32,$BS$4>=35,$BS$4<=37),BU179&\"F\",0)","v":{"$error":"#N/A"}}]
[null,null,null,null,null,null,null,null,null,null,null,null,null,null,null,null,null,null,null,null,null,null,null,null,null,null,null,null,null,"Top Sash",0,null,null,null,"Top Sash",0,null,null,null,{"$error":"#N/A"},{"$error":"#N/A"},{"$f":"IF(AND(AO180=37,$AM$4>=12,$AM$4<=16.99),AO180&\"-\"&\"2\",0)","v":{"$error":"#N/A"}},null,null,{"$error":"#N/A"},{"$error":"#N/A"},{"$f":"IF(AND(AT180=37,$AR$4>=12,$AR$4<=16.99),AT180&\"-\"&\"2\",0)","v":{"$error":"#N/A"}},null,null,null,null,null,null,null,null,null,null,null,null,null,null,null,null,null,null,null,{"$error":"#N/A"},{"$error":"#N/A"},{"$f":"IF(AND(BP180=32,$BN$4>=38,$BN$4<=40),BP180&\"G\",0)","v":{"$error":"#N/A"}},null,null,{"$error":"#N/A"},{"$error":"#N/A"},{"$f":"IF(AND(BU180=32,$BS$4>=38,$BS$4<=40),BU180&\"G\",0)","v":{"$error":"#N/A"}}]
[null,null,null,null,null,null,null,null,null,null,null,null,null,null,null,null,null,null,null,null,null,null,null,null,null,null,null,null,null,"Bottom Sash",{"$f":"IF(ModelNo=\"8SPP\",TRUNC(SUM(AE171:AE179)),0)","v":0},null,null,null,"Bottom Sash",{"$f":"IF(ModelNo=\"8POS\",TRUNC(SUM(AJ171:AJ179)),0)","v":0},null,null,null,{"$error":"#N/A"},{"$error":"#N/A"},{"$f":"IF(AND(AO181=37,$AM$4>=17,$AM$4<=22.99),AO181&\"-\"&\"3\",0)","v":{"$error":"#N/A"}},null,null,{"$error":"#N/A"},{"$error":"#N/A"},{"$f":"IF(AND(AT181=37,$AR$4>=17,$AR$4<=22.99),AT181&\"-\"&\"3\",0)","v":{"$error":"#N/A"}},null,null,null,null,null,null,null,null,null,null,null,null,null,null,null,null,null,null,null,{"$error":"#N/A"},{"$error":"#N/A"},{"$f":"IF(AND(BP181=32,$BN$4>=41,$BN$4<=43),BP181&\"H\",0)","v":{"$error":"#N/A"}},null,null,{"$error":"#N/A"},{"$error":"#N/A"},{"$f":"IF(AND(BU181=32,$BS$4>=41,$BS$4<=43),BU181&\"H\",0)","v":{"$error":"#N/A"}}]
[null,null,null,null,null,null,null,null,null,null,null,null,null,null,null,null,null,null,null,null,null,null,null,null,null,null,null,null,null,null,null,null,null,null,null,null,null,null,null,{"$error":"#N/A"},{"$error":"#N/A"},{"$f":"IF(AND(AO182=37,$AM$4>=23,$AM$4<=28.99),AO182&\"-\"&\"4\",0)","v":{"$error":"#N/A"}},null,null,{"$error":"#N/A"},{"$error":"#N/A"},{"$f":"IF(AND(AT182=37,$AR$4>=23,$AR$4<=28.99),AT182&\"-\"&\"4\",0)","v":{"$error":"#N/A"}},null,null,null,null,null,null,null,null,null,null,null,null,null,null,null,null,null,null,null,{"$error":"#N/A"},{"$error":"#N/A"},{"$f":"IF(AND(BP182=32,$BN$4>=44,$BN$4<=45),BP182&\"I\",0)","v":{"$error":"#N/A"}},null,null,{"$error":"#N/A"},{"$error":"#N/A"},{"$f":"IF(AND(BU182=32,$BS$4>=44,$BS$4<=45),BU182&\"I\",0)","v":{"$error":"#N/A"}}]
[null,null,null,null,null,null,null,null,null,null,null,null,null,null,null,null,null,null,null,null,null,null,null,null,null,null,null,"8PS3","Length","Weight/ft","Weight",null,"8SOP","Length","Weight/ft","Weight",null,null,null,{"$error":"#N/A"},{"$error":"#N/A"},{"$f":"IF(AND(AO183=37,$AM$4>=29,$AM$4<=33.99),AO183&\"-\"&\"5\",0)","v":{"$error":"#N/A"}},null,null,{"$error":"#N/A"},{"$error":"#N/A"},{"$f":"IF(AND(AT183=37,$AR$4>=29,$AR$4<=33.99),AT183&\"-\"&\"5\",0)","v":{"$error":"#N/A"}},null,null,null,null,null,null,null,null,null,null,null,null,null,null,null,null,null,null,null,{"$error":"#N/A"},{"$error":"#N/A"},{"$f":"IF(AND(BP183=32,$BN$4>=46,$BN$4<=50),\"Dbl.\"&BP183&\"C\",0)","v":{"$error":"#N/A"}},null,null,{"$error":"#N/A"},{"$error":"#N/A"},{"$f":"IF(AND(BU183=32,$BS$4>=46,$BS$4<=50),\"Dbl.\"&BU183&\"C\",0)","v":{"$error":"#N/A"}}]
[null,null,null,null,null,null,null,null,null,null,null,null,null,null,null,null,null,null,null,null,null,null,null,null,null,null,null,"Right Top Rail",{"$f":"Data!D883/12","v":-0.19270833333333334},0.24299999999999999,{"$f":"AC184*AD184","v":-4.6828124999999998E-2},null,"Top Top Rail",0,0,{"$f":"AH184*AI184","v":0},null,null,null,{"$error":"#N/A"},{"$error":"#N/A"},{"$f":"IF(AND(AO184=37,$AM$4>=34,$AM$4<=37.99),AO184&\"-\"&\"6\",0)","v":{"$error":"#N/A"}},null,null,{"$error":"#N/A"},{"$error":"#N/A"},{"$f":"IF(AND(AT184=37,$AR$4>=34,$AR$4<=37.99),AT184&\"-\"&\"6\",0)","v":{"$error":"#N/A"}},null,null,null,null,null,null,null,null,null,null,null,null,null,null,null,null,null,null,null,{"$error":"#N/A"},{"$error":"#N/A"},{"$f":"IF(AND(BP184=32,$BN$4>=51,$BN$4<=60),\"Dbl.\"&BP184&\"D\",0)","v":{"$error":"#N/A"}},null,null,{"$error":"#N/A"},{"$error":"#N/A"},{"$f":"IF(AND(BU184=32,$BS$4>=51,$BS$4<=60),\"Dbl.\"&BU184&\"D\",0)","v":{"$error":"#N/A"}}]
[null,null,null,null,null,null,null,null,null,null,null,null,null,null,null,null,null,null,null,null,null,null,null,null,null,null,null,"Right Bottom Rail",{"$f":"Data!D883/12","v":-0.19270833333333334},0.216,{"$f":"AC185*AD185","v":-4.1625000000000002E-2},null,"Top Bottom Rail",0,0,{"$f":"AH185*AI185","v":0},null,null,null,{"$error":"#N/A"},{"$error":"#N/A"},{"$f":"IF(AND(AO185=37,$AM$4>=38,$AM$4<=39.99),AO185&\"-\"&\"9\",0)","v":{"$error":"#N/A"}},null,null,{"$error":"#N/A"},{"$error":"#N/A"},{"$f":"IF(AND(AT185=37,$AR$4>=38,$AR$4<=39.99),AT185&\"-\"&\"9\",0)","v":{"$error":"#N/A"}},null,null,null,null,null,null,null,null,null,null,null,null,null,null,null,null,null,null,null,{"$error":"#N/A"},{"$error":"#N/A"},{"$f":"IF(AND(BP185=32,$BN$4>=61,$BN$4<=68),\"Dbl.\"&BP185&\"E\",0)","v":{"$error":"#N/A"}},null,null,{"$error":"#N/A"},{"$error":"#N/A"},{"$f":"IF(AND(BU185=32,$BS$4>=61,$BS$4<=68),\"Dbl.\"&BU185&\"E\",0)","v":{"$error":"#N/A"}}]
[null,null,null,null,null,null,null,null,null,null,null,null,null,null,null,null,null,null,null,null,null,null,null,null,null,null,null,"Right Stile",{"$f":"(Data!D884/12)*2","v":-0.20833333333333334},0.185,{"$f":"AC186*AD186","v":-3.8541666666666669E-2},null,"Top Stile",0,0,{"$f":"(AH186*AI186)/12","v":0},null,null,null,{"$error":"#N/A"},{"$error":"#N/A"},{"$f":"IF(AND(AO186=37,$AM$4>=40,$AM$4<=42.99),AO186&\"-\"&\"12\",0)","v":{"$error":"#N/A"}},null,null,{"$error":"#N/A"},{"$error":"#N/A"},{"$f":"IF(AND(AT186=37,$AR$4>=40,$AR$4<=42.99),AT186&\"-\"&\"12\",0)","v":{"$error":"#N/A"}},null,null,null,null,null,null,null,null,null,null,null,null,null,null,null,null,null,null,null,{"$error":"#N/A"},{"$error":"#N/A"},{"$f":"IF(AND(BP186=32,$BN$4>=69,$BN$4<=74),\"Dbl.\"&BP186&\"F\",0)","v":{"$error":"#N/A"}},null,null,{"$error":"#N/A"},{"$error":"#N/A"},{"$f":"IF(AND(BU186=32,$BS$4>=69,$BS$4<=74),\"Dbl.\"&BU186&\"F\",0)","v":{"$error":"#N/A"}}]
[null,null,null,null,null,null,null,null,null,null,null,null,null,null,null,null,null,null,null,null,null,null,null,null,null,null,null,"Right Rail Reinf.",{"$f":"((AC184*12)-2.6875)/12","v":-0.41666666666666669},0.17199999999999999,{"$f":"AC187*AD187","v":-7.166666666666667E-2},null,"Top Rail Reinf.",0,0,0,null,null,null,{"$error":"#N/A"},{"$error":"#N/A"},{"$f":"IF(AND(AO187=37,$AM$4>=43,$AM$4<=44.99),AO187&\"-\"&\"13\",0)","v":{"$error":"#N/A"}},null,null,{"$error":"#N/A"},{"$error":"#N/A"},{"$f":"IF(AND(AT187=37,$AR$4>=43,$AR$4<=44.99),AT187&\"-\"&\"13\",0)","v":{"$error":"#N/A"}},"x",null,null,null,null,null,null,null,null,null,null,null,null,null,null,null,null,null,null,{"$error":"#N/A"},{"$error":"#N/A"},{"$f":"IF(AND(BP187=32,$BN$4>=75,$BN$4<=80),\"Dbl.\"&BP187&\"G\",0)","v":{"$error":"#N/A"}},null,null,{"$error":"#N/A"},{"$error":"#N/A"},{"$f":"IF(AND(BU187=32,$BS$4>=75,$BS$4<=80),\"Dbl.\"&BU187&\"G\",0)","v":{"$error":"#N/A"}}]
[null,null,null,null,null,null,null,null,null,null,null,null,null,null,null,null,null,null,null,null,null,null,null,null,null,null,null,"Right Stile Reinf",null,null,null,null,"Top Stile Reinf",0,0,0,null,null,null,{"$error":"#N/A"},{"$error":"#N/A"},{"$f":"IF(AND(AO188=37,$AM$4>=45,$AM$4<=47.99),AO188&\"-\"&\"14\",0)","v":{"$error":"#N/A"}},null,null,{"$error":"#N/A"},{"$error":"#N/A"},{"$f":"IF(AND(AT188=37,$AR$4>=45,$AR$4<=47.99),AT188&\"-\"&\"14\",0)","v":{"$error":"#N/A"}},null,null,null,null,null,null,null,null,null,null,null,null,null,null,null,null,null,null,null,{"$error":"#N/A"},{"$f":"IF(AND($BO$4<=34,$BO$4>32),34,0)","v":{"$error":"#N/A"}},{"$f":"IF(AND(BP188=34,$BN$4>=11,$BN$4<=16),BP188&\"A\",0)","v":{"$error":"#N/A"}},null,null,{"$error":"#N/A"},{"$f":"IF(AND($BT$4<=34,$BT$4>32),34,0)","v":{"$error":"#N/A"}},{"$f":"IF(AND(BU188=34,$BS$4>=11,$BS$4<=16),BU188&\"A\",0)","v":{"$error":"#N/A"}}]
[null,null,null,null,null,null,null,null,null,null,null,null,null,null,null,null,null,null,null,null,null,null,null,null,null,null,null,"Right Glass",{"$f":"(((AC184*12)-2.5625)*((AC186*12)-2.5625))/144","v":0.17138671875},{"$f":"$H$10","v":2.3140000000000001},{"$f":"AC189*AD189","v":0.39658886718750003},null,"Top Glass",0,0,0,null,null,null,{"$error":"#N/A"},{"$error":"#N/A"},{"$f":"IF(AND(AO189=37,$AM$4>=48,$AM$4<=50.99),AO189&\"-\"&\"15\",0)","v":{"$error":"#N/A"}},null,null,{"$error":"#N/A"},{"$error":"#N/A"},{"$f":"IF(AND(AT189=37,$AR$4>=48,$AR$4<=50.99),AT189&\"-\"&\"15\",0)","v":{"$error":"#N/A"}},null,null,null,null,null,null,null,null,null,null,null,null,null,null,null,null,null,null,null,{"$error":"#N/A"},{"$error":"#N/A"},{"$f":"IF(AND(BP189=34,$BN$4>=17,$BN$4<=22),BP189&\"B\",0)","v":{"$error":"#N/A"}},null,null,{"$error":"#N/A"},{"$error":"#N/A"},{"$f":"IF(AND(BU189=34,$BS$4>=17,$BS$4<=22),BU189&\"B\",0)","v":{"$error":"#N/A"}}]
[null,null,null,null,null,null,null,null,null,null,null,null,null,null,null,null,null,null,null,null,null,null,null,null,null,null,null,"Right Spacer",{"$f":"(((AC184*12)*2)+((AC186*12)*2))/12","v":-0.80208333333333337},5.3600000000000002E-2,{"$f":"AC190*AD190","v":-4.2991666666666671E-2},null,"Top Spacer",0,0,0,null,null,null,{"$error":"#N/A"},{"$error":"#N/A"},{"$f":"IF(AND(AO190=37,$AM$4>=51,$AM$4<=53),AO190&\"-\"&\"16\",0)","v":{"$error":"#N/A"}},null,null,{"$error":"#N/A"},{"$error":"#N/A"},{"$f":"IF(AND(AT190=37,$AR$4>=51,$AR$4<=53),AT190&\"-\"&\"16\",0)","v":{"$error":"#N/A"}},null,null,null,null,null,null,null,null,null,null,null,null,null,null,null,null,null,null,null,{"$error":"#N/A"},{"$error":"#N/A"},{"$f":"IF(AND(BP190=34,$BN$4>=23,$BN$4<=27),BP190&\"C\",0)","v":{"$error":"#N/A"}},null,null,{"$error":"#N/A"},{"$error":"#N/A"},{"$f":"IF(AND(BU190=34,$BS$4>=23,$BS$4<=27),BU190&\"C\",0)","v":{"$error":"#N/A"}}]
[null,null,null,null,null,null,null,null,null,null,null,null,null,null,null,null,null,null,null,null,null,null,null,null,null,null,null,"Right Hardware",1,0.36,{"$f":"AC191*AD191","v":0.36},null,"Top Hardware",0,0,0,null,null,null,{"$f":"IF(AND(AO191>0,AP191>0),AO191,0)","v":{"$error":"#N/A"}},{"$f":"IF(AND($AN$4<=39,$AN$4>37),39,0)","v":{"$error":"#N/A"}},{"$f":"IF(AND(AO191=39,$AM$4>=8,$AM$4<=11.99),AO191&\"-\"&\"1\",0)","v":{"$error":"#N/A"}},null,null,{"$error":"#N/A"},{"$f":"IF(AND($AS$4<=39,$AS$4>37),39,0)","v":{"$error":"#N/A"}},{"$f":"IF(AND(AT191=39,$AR$4>=8,$AR$4<=11.99),AT191&\"-\"&\"1\",0)","v":{"$error":"#N/A"}},null,null,null,null,null,null,null,null,null,null,null,null,null,null,null,null,null,null,null,{"$error":"#N/A"},{"$error":"#N/A"},{"$f":"IF(AND(BP191=34,$BN$4>=28,$BN$4<=32),BP191&\"D\",0)","v":{"$error":"#N/A"}},null,null,{"$error":"#N/A"},{"$error":"#N/A"},{"$f":"IF(AND(BU191=34,$BS$4>=28,$BS$4<=32),BU191&\"D\",0)","v":{"$error":"#N/A"}}]
[null,null,null,null,null,null,null,null,null,null,null,null,null,null,null,null,null,null,null,null,null,null,null,null,null,null,null,"Right Bead",{"$f":"((((AC184*12)-2.25)*2)+(((AC186*12)-2.25)*2))/12","v":-1.5520833333333333},1.9E-2,{"$f":"AC192*AD192","v":-2.9489583333333333E-2},null,"Top Bead",0,0,0,null,null,null,{"$error":"#N/A"},{"$error":"#N/A"},{"$f":"IF(AND(AO192=39,$AM$4>=12,$AM$4<=16.99),AO192&\"-\"&\"2\",0)","v":{"$error":"#N/A"}},null,null,{"$error":"#N/A"},{"$error":"#N/A"},{"$f":"IF(AND(AT192=39,$AR$4>=12,$AR$4<=16.99),AT192&\"-\"&\"2\",0)","v":{"$error":"#N/A"}},null,null,null,null,null,null,null,null,null,null,null,null,null,null,null,null,null,null,null,{"$error":"#N/A"},{"$error":"#N/A"},{"$f":"IF(AND(BP192=34,$BN$4>=33,$BN$4<=34),BP192&\"E\",0)","v":{"$error":"#N/A"}},null,null,{"$error":"#N/A"},{"$error":"#N/A"},{"$f":"IF(AND(BU192=34,$BS$4>=33,$BS$4<=34),BU192&\"E\",0)","v":{"$error":"#N/A"}}]
[null,null,null,null,null,null,null,null,null,null,null,null,null,null,null,null,null,null,null,null,null,null,null,null,null,null,null,"Left Top Rail",{"$f":"Data!D882/12","v":-0.19270833333333334},0.24299999999999999,{"$f":"AC193*AD193","v":-4.6828124999999998E-2},null,"Bottom Top Rail",{"$f":"Data!D866/12","v":-0.22916666666666666},0.24299999999999999,{"$f":"AH193*AI193","v":-5.5687499999999994E-2},null,null,null,{"$error":"#N/A"},{"$error":"#N/A"},{"$f":"IF(AND(AO193=39,$AM$4>=17,$AM$4<=22.99),AO193&\"-\"&\"3\",0)","v":{"$error":"#N/A"}},null,null,{"$error":"#N/A"},{"$error":"#N/A"},{"$f":"IF(AND(AT193=39,$AR$4>=17,$AR$4<=22.99),AT193&\"-\"&\"3\",0)","v":{"$error":"#N/A"}},null,null,null,null,null,null,null,null,null,null,null,null,null,null,null,null,null,null,null,{"$error":"#N/A"},{"$error":"#N/A"},{"$f":"IF(AND(BP193=34,$BN$4>=35,$BN$4<=37),BP193&\"F\",0)","v":{"$error":"#N/A"}},null,null,{"$error":"#N/A"},{"$error":"#N/A"},{"$f":"IF(AND(BU193=34,$BS$4>=35,$BS$4<=37),BU193&\"F\",0)","v":{"$error":"#N/A"}}]
[null,null,null,null,null,null,null,null,null,null,null,null,null,null,null,null,null,null,null,null,null,null,null,null,null,null,null,"Left Bottom Rail",{"$f":"Data!D882/12","v":-0.19270833333333334},0.216,-4.1625000000000002E-2,null,"Bottom Bottom Rail",{"$f":"Data!D866/12","v":-0.22916666666666666},0.216,-4.9499999999999995E-2,null,null,null,{"$error":"#N/A"},{"$error":"#N/A"},{"$f":"IF(AND(AO194=39,$AM$4>=23,$AM$4<=28.99),AO194&\"-\"&\"4\",0)","v":{"$error":"#N/A"}},null,null,{"$error":"#N/A"},{"$error":"#N/A"},{"$f":"IF(AND(AT194=39,$AR$4>=23,$AR$4<=28.99),AT194&\"-\"&\"4\",0)","v":{"$error":"#N/A"}},null,null,null,null,null,null,null,null,null,null,null,null,null,null,null,null,null,null,null,{"$error":"#N/A"},{"$error":"#N/A"},{"$f":"IF(AND(BP194=34,$BN$4>=38,$BN$4<=40),BP194&\"G\",0)","v":{"$error":"#N/A"}},null,null,{"$error":"#N/A"},{"$error":"#N/A"},{"$f":"IF(AND(BU194=34,$BS$4>=38,$BS$4<=40),BU194&\"G\",0)","v":{"$error":"#N/A"}}]
[null,null,null,null,null,null,null,null,null,null,null,null,null,null,null,null,null,null,null,null,null,null,null,null,null,null,null,"Left Stile",{"$f":"(Data!D884/12)*2","v":-0.20833333333333334},0.185,-3.8541666666666669E-2,null,"Bottom Stile",{"$f":"(Data!D867/12)*2","v":-0.20833333333333334},0.185,-3.8541666666666669E-2,null,null,null,{"$error":"#N/A"},{"$error":"#N/A"},{"$f":"IF(AND(AO195=39,$AM$4>=29,$AM$4<=33.99),AO195&\"-\"&\"5\",0)","v":{"$error":"#N/A"}},null,null,{"$error":"#N/A"},{"$error":"#N/A"},{"$f":"IF(AND(AT195=39,$AR$4>=29,$AR$4<=33.99),AT195&\"-\"&\"5\",0)","v":{"$error":"#N/A"}},null,null,null,null,null,null,null,null,null,null,null,null,null,null,null,null,null,null,null,{"$error":"#N/A"},{"$error":"#N/A"},{"$f":"IF(AND(BP195=34,$BN$4>=41,$BN$4<=43),BP195&\"H\",0)","v":{"$error":"#N/A"}},null,null,{"$error":"#N/A"},{"$error":"#N/A"},{"$f":"IF(AND(BU195=34,$BS$4>=41,$BS$4<=43),BU195&\"H\",0)","v":{"$error":"#N/A"}}]
[null,null,null,null,null,null,null,null,null,null,null,null,null,null,null,null,null,null,null,null,null,null,null,null,null,null,null,"Left Rail Reinf.",{"$f":"((AC193*12)-2.6875)/12","v":-0.41666666666666669},0.17199999999999999,-7.166666666666667E-2,null,"Bottom Rail Reinf.",{"$f":"((AH193*12)-2.6875)/12","v":-0.453125},0.17199999999999999,-7.7937499999999993E-2,null,null,null,{"$error":"#N/A"},{"$error":"#N/A"},{"$f":"IF(AND(AO196=39,$AM$4>=34,$AM$4<=37.99),AO196&\"-\"&\"6\",0)","v":{"$error":"#N/A"}},null,null,{"$error":"#N/A"},{"$error":"#N/A"},{"$f":"IF(AND(AT196=39,$AR$4>=34,$AR$4<=37.99),AT196&\"-\"&\"6\",0)","v":{"$error":"#N/A"}},null,null,null,null,null,null,null,null,null,null,null,null,null,null,null,null,null,null,null,{"$error":"#N/A"},{"$error":"#N/A"},{"$f":"IF(AND(BP196=34,$BN$4>=44,$BN$4<=45),BP196&\"I\",0)","v":{"$error":"#N/A"}},null,null,{"$error":"#N/A"},{"$error":"#N/A"},{"$f":"IF(AND(BU196=34,$BS$4>=44,$BS$4<=45),BU196&\"I\",0)","v":{"$error":"#N/A"}}]
[null,null,null,null,null,null,null,null,null,null,null,null,null,null,null,null,null,null,null,null,null,null,null,null,null,null,null,"Left Stile Reinf.",null,null,null,null,"Bottom Stile Reinf.",null,null,0,null,null,null,{"$error":"#N/A"},{"$error":"#N/A"},{"$f":"IF(AND(AO197=39,$AM$4>=38,$AM$4<=39.99),AO197&\"-\"&\"9\",0)","v":{"$error":"#N/A"}},null,null,{"$error":"#N/A"},{"$error":"#N/A"},{"$f":"IF(AND(AT197=39,$AR$4>=38,$AR$4<=39.99),AT197&\"-\"&\"9\",0)","v":{"$error":"#N/A"}},null,null,null,null,null,null,null,null,null,null,null,null,null,null,null,null,null,null,null,{"$f":"IF(AND(BP197>0,BQ197>0),BP197,0)","v":{"$error":"#N/A"}},{"$error":"#N/A"},{"$f":"IF(AND(BP197=34,$BN$4>=46,$BN$4<=54),\"Dbl.\"&BP197&\"C\",0)","v":{"$error":"#N/A"}},null,null,{"$f":"IF(AND(BU197>0,BV197>0),BU197,0)","v":{"$error":"#N/A"}},{"$error":"#N/A"},{"$f":"IF(AND(BU197=34,$BS$4>=46,$BS$4<=54),\"Dbl.\"&BU197&\"C\",0)","v":{"$error":"#N/A"}}]
[null,null,null,null,null,null,null,null,null,null,null,null,null,null,null,null,null,null,null,null,null,null,null,null,null,null,null,"Left Glass",{"$f":"(((AC193*12)-2.5625)*((AC195*12)-2.5625))/144","v":0.17138671875},{"$f":"$H$10","v":2.3140000000000001},0.39658886718750003,null,"Bottom Glass",{"$f":"(((AH193*12)-2.5625)*((AH195*12)-2.5))/144","v":0.18446180555555555},{"$f":"$H$10","v":2.3140000000000001},0.42684461805555557,null,null,null,{"$error":"#N/A"},{"$error":"#N/A"},{"$f":"IF(AND(AO198=39,$AM$4>=40,$AM$4<=42.99),AO198&\"-\"&\"12\",0)","v":{"$error":"#N/A"}},null,null,{"$error":"#N/A"},{"$error":"#N/A"},{"$f":"IF(AND(AT198=39,$AR$4>=40,$AR$4<=42.99),AT198&\"-\"&\"12\",0)","v":{"$error":"#N/A"}},"x",null,null,null,null,null,null,null,null,null,null,null,null,null,null,null,null,null,null,{"$error":"#N/A"},{"$error":"#N/A"},{"$f":"IF(AND(BP198=34,$BN$4>=55,$BN$4<=64),\"Dbl.\"&BP198&\"D\",0)","v":{"$error":"#N/A"}},null,null,{"$error":"#N/A"},{"$error":"#N/A"},{"$f":"IF(AND(BU198=34,$BS$4>=55,$BS$4<=64),\"Dbl.\"&BU198&\"D\",0)","v":{"$error":"#N/A"}}]
[null,null,null,null,null,null,null,null,null,null,null,null,null,null,null,null,null,null,null,null,null,null,null,null,null,null,null,"Left Spacer",{"$f":"(((AC193*12)*2)+((AC195*12)*2))/12","v":-0.80208333333333337},5.3600000000000002E-2,{"$f":"AC199*AD199","v":-4.2991666666666671E-2},null,"Bottom Spacer",{"$f":"(((AH193*12)*2)+((AH195*12)*2))/12","v":-0.875},5.3600000000000002E-2,{"$f":"AH199*AI199","v":-4.6900000000000004E-2},null,null,null,{"$error":"#N/A"},{"$error":"#N/A"},{"$f":"IF(AND(AO199=39,$AM$4>=43,$AM$4<=44.99),AO199&\"-\"&\"13\",0)","v":{"$error":"#N/A"}},null,null,{"$error":"#N/A"},{"$error":"#N/A"},{"$f":"IF(AND(AT199=39,$AR$4>=43,$AR$4<=44.99),AT199&\"-\"&\"13\",0)","v":{"$error":"#N/A"}},null,null,null,null,null,null,null,null,null,null,null,null,null,null,null,null,null,null,null,{"$error":"#N/A"},{"$error":"#N/A"},{"$f":"IF(AND(BP199=34,$BN$4>=65,$BN$4<=68),\"Dbl.\"&BP199&\"E\",0)","v":{"$error":"#N/A"}},null,null,{"$error":"#N/A"},{"$error":"#N/A"},{"$f":"IF(AND(BU199=34,$BS$4>=65,$BS$4<=68),\"Dbl.\"&BU199&\"E\",0)","v":{"$error":"#N/A"}}]
[null,null,null,null,null,null,null,null,null,null,null,null,null,null,null,null,null,null,null,null,null,null,null,null,null,null,null,"Left Hardware",1,0.36,{"$f":"AC200*AD200","v":0.36},null,"Bottom Hardware",1,0.36,{"$f":"AH200*AI200","v":0.36},null,null,null,{"$error":"#N/A"},{"$error":"#N/A"},{"$f":"IF(AND(AO200=39,$AM$4>=45,$AM$4<=47.99),AO200&\"-\"&\"14\",0)","v":{"$error":"#N/A"}},null,null,{"$error":"#N/A"},{"$error":"#N/A"},{"$f":"IF(AND(AT200=39,$AR$4>=45,$AR$4<=47.99),AT200&\"-\"&\"14\",0)","v":{"$error":"#N/A"}},null,null,null,null,null,null,null,null,null,null,null,null,null,null,null,null,null,null,null,{"$error":"#N/A"},{"$error":"#N/A"},{"$f":"IF(AND(BP200=34,$BN$4>=69,$BN$4<=74),\"Dbl.\"&BP200&\"F\",0)","v":{"$error":"#N/A"}},null,null,{"$error":"#N/A"},{"$error":"#N/A"},{"$f":"IF(AND(BU200=34,$BS$4>=69,$BS$4<=74),\"Dbl.\"&BU200&\"F\",0)","v":{"$error":"#N/A"}}]
[null,null,null,null,null,null,null,null,null,null,null,null,null,null,null,null,null,null,null,null,null,null,null,null,null,null,null,"Left Bead",{"$f":"((((AC193*12)-2.25)*2)+(((AC195*12)-2.25)*2))/12","v":-1.5520833333333333},1.9E-2,{"$f":"AC201*AD201","v":-2.9489583333333333E-2},null,"Bottom Bead",{"$f":"((((AH193*12)-2.25)*2)+(((AH195*12)-2.25)*2))/12","v":-1.625},1.9E-2,{"$f":"AH201*AI201","v":-3.0875E-2},null,null,null,{"$error":"#N/A"},{"$error":"#N/A"},{"$f":"IF(AND(AO201=39,$AM$4>=48,$AM$4<=50.99),AO201&\"-\"&\"15\",0)","v":{"$error":"#N/A"}},null,null,{"$error":"#N/A"},{"$error":"#N/A"},{"$f":"IF(AND(AT201=39,$AR$4>=48,$AR$4<=50.99),AT201&\"-\"&\"15\",0)","v":{"$error":"#N/A"}},null,null,null,null,null,null,null,null,null,null,null,null,null,null,null,null,null,null,null,{"$error":"#N/A"},{"$error":"#N/A"},{"$f":"IF(AND(BP201=34,$BN$4>=75,$BN$4<=80),\"Dbl.\"&BP201&\"G\",0)","v":{"$error":"#N/A"}},null,null,{"$error":"#N/A"},{"$error":"#N/A"},{"$f":"IF(AND(BU201=34,$BS$4>=75,$BS$4<=80),\"Dbl.\"&BU201&\"G\",0)","v":{"$error":"#N/A"}}]
[null,null,null,null,null,null,null,null,null,null,null,null,null,null,null,null,null,null,null,null,null,null,null,null,null,null,null,null,null,"Right Sash",{"$f":"IF(ModelNo=\"8PS3\",TRUNC(SUM(AE184:AE192)),0)","v":0},null,null,null,"Top Sash",0,null,null,null,{"$error":"#N/A"},{"$error":"#N/A"},{"$f":"IF(AND(AO202=39,$AM$4>=51,$AM$4<=53),AO202&\"-\"&\"16\",0)","v":{"$error":"#N/A"}},null,null,{"$error":"#N/A"},{"$error":"#N/A"},{"$f":"IF(AND(AT202=39,$AR$4>=51,$AR$4<=53),AT202&\"-\"&\"16\",0)","v":{"$error":"#N/A"}},null,null,null,null,null,null,null,null,null,null,null,null,null,null,null,null,null,null,null,{"$error":"#N/A"},{"$f":"IF(AND($BO$4<=36,$BO$4>34),36,0)","v":{"$error":"#N/A"}},{"$f":"IF(AND(BP202=36,$BN$4>=11,$BN$4<=16),BP202&\"A\",0)","v":{"$error":"#N/A"}},null,null,{"$error":"#N/A"},{"$f":"IF(AND($BT$4<=36,$BT$4>34),36,0)","v":{"$error":"#N/A"}},{"$f":"IF(AND(BU202=36,$BS$4>=11,$BS$4<=16),BU202&\"A\",0)","v":{"$error":"#N/A"}}]
[null,null,null,null,null,null,null,null,null,null,null,null,null,null,null,null,null,null,null,null,null,null,null,null,null,null,null,null,null,"Left Sash",{"$f":"IF(ModelNo=\"8PS3\",TRUNC(SUM(AE193:AE201)),0)","v":0},null,null,null,"Bottom Sash",{"$f":"IF(ModelNo=\"8SOP\",TRUNC(SUM(AJ193:AJ201)),0)","v":0},null,null,null,{"$f":"IF(AND(AO203>0,AP203>0),AO203,0)","v":{"$error":"#N/A"}},{"$f":"IF(AND($AN$4<=41,$AN$4>39),41,0)","v":{"$error":"#N/A"}},{"$f":"IF(AND(AO203=41,$AM$4>=9,$AM$4<=12.99),AO203&\"-\"&\"1\",0)","v":{"$error":"#N/A"}},null,null,{"$error":"#N/A"},{"$f":"IF(AND($AS$4<=41,$AS$4>39),41,0)","v":{"$error":"#N/A"}},{"$f":"IF(AND(AT203=41,$AR$4>=9,$AR$4<=12.99),AT203&\"-\"&\"1\",0)","v":{"$error":"#N/A"}},null,null,null,null,null,null,null,null,null,null,null,null,null,null,null,null,null,null,null,{"$error":"#N/A"},{"$error":"#N/A"},{"$f":"IF(AND(BP203=36,$BN$4>=17,$BN$4<=22),BP203&\"B\",0)","v":{"$error":"#N/A"}},null,null,{"$error":"#N/A"},{"$error":"#N/A"},{"$f":"IF(AND(BU203=36,$BS$4>=17,$BS$4<=22),BU203&\"B\",0)","v":{"$error":"#N/A"}}]
[null,null,null,null,null,null,null,null,null,null,null,null,null,null,null,null,null,null,null,null,null,null,null,null,null,null,null,null,null,null,null,null,null,null,null,null,null,null,null,{"$error":"#N/A"},{"$error":"#N/A"},{"$f":"IF(AND(AO204=41,$AM$4>=13,$AM$4<=17.99),AO204&\"-\"&\"2\",0)","v":{"$error":"#N/A"}},null,null,{"$error":"#N/A"},{"$error":"#N/A"},{"$f":"IF(AND(AT204=41,$AR$4>=13,$AR$4<=17.99),AT204&\"-\"&\"2\",0)","v":{"$error":"#N/A"}},null,null,null,null,null,null,null,null,null,null,null,null,null,null,null,null,null,null,null,{"$error":"#N/A"},{"$error":"#N/A"},{"$f":"IF(AND(BP204=36,$BN$4>=23,$BN$4<=27),BP204&\"C\",0)","v":{"$error":"#N/A"}},null,null,{"$error":"#N/A"},{"$error":"#N/A"},{"$f":"IF(AND(BU204=36,$BS$4>=23,$BS$4<=27),BU204&\"C\",0)","v":{"$error":"#N/A"}}]
[null,null,null,null,null,null,null,null,null,null,null,null,null,null,null,null,null,null,null,null,null,null,null,null,null,null,null,"8SP3","Length","Weight/ft","Weight",null,null,null,null,null,null,null,null,{"$error":"#N/A"},{"$error":"#N/A"},{"$f":"IF(AND(AO205=41,$AM$4>=18,$AM$4<=23.99),AO205&\"-\"&\"3\",0)","v":{"$error":"#N/A"}},null,null,{"$f":"IF(AND(AT205>0,AU205>0),AT205,0)","v":{"$error":"#N/A"}},{"$error":"#N/A"},{"$f":"IF(AND(AT205=41,$AR$4>=18,$AR$4<=23.99),AT205&\"-\"&\"3\",0)","v":{"$error":"#N/A"}},null,null,null,null,null,null,null,null,null,null,null,null,null,null,null,null,null,null,null,{"$error":"#N/A"},{"$error":"#N/A"},{"$f":"IF(AND(BP205=36,$BN$4>=28,$BN$4<=32),BP205&\"D\",0)","v":{"$error":"#N/A"}},null,null,{"$error":"#N/A"},{"$error":"#N/A"},{"$f":"IF(AND(BU205=36,$BS$4>=28,$BS$4<=32),BU205&\"D\",0)","v":{"$error":"#N/A"}}]
[null,null,null,null,null,null,null,null,null,null,null,null,null,null,null,null,null,null,null,null,null,null,null,null,null,null,null,"Right Top Rail",{"$f":"Data!D906/12","v":-0.19270833333333334},0.24299999999999999,{"$f":"AC206*AD206","v":-4.6828124999999998E-2},null,null,null,null,null,null,null,null,{"$error":"#N/A"},{"$error":"#N/A"},{"$f":"IF(AND(AO206=41,$AM$4>=24,$AM$4<=28.99),AO206&\"-\"&\"4\",0)","v":{"$error":"#N/A"}},null,null,{"$error":"#N/A"},{"$error":"#N/A"},{"$f":"IF(AND(AT206=41,$AR$4>=24,$AR$4<=28.99),AT206&\"-\"&\"4\",0)","v":{"$error":"#N/A"}},null,null,null,null,null,null,null,null,null,null,null,null,null,null,null,null,null,null,null,{"$error":"#N/A"},{"$error":"#N/A"},{"$f":"IF(AND(BP206=36,$BN$4>=33,$BN$4<=34),BP206&\"E\",0)","v":{"$error":"#N/A"}},null,null,{"$error":"#N/A"},{"$error":"#N/A"},{"$f":"IF(AND(BU206=36,$BS$4>=33,$BS$4<=34),BU206&\"E\",0)","v":{"$error":"#N/A"}}]
[null,null,null,null,null,null,null,null,null,null,null,null,null,null,null,null,null,null,null,null,null,null,null,null,null,null,null,"Right Bottom Rail",{"$f":"Data!D906/12","v":-0.19270833333333334},0.216,{"$f":"AC207*AD207","v":-4.1625000000000002E-2},null,null,null,null,null,null,null,null,{"$error":"#N/A"},{"$error":"#N/A"},{"$f":"IF(AND(AO207=41,$AM$4>=29,$AM$4<=34.99),AO207&\"-\"&\"5\",0)","v":{"$error":"#N/A"}},null,null,{"$error":"#N/A"},{"$error":"#N/A"},{"$f":"IF(AND(AT207=41,$AR$4>=29,$AR$4<=34.99),AT207&\"-\"&\"5\",0)","v":{"$error":"#N/A"}},null,null,null,null,null,null,null,null,null,null,null,null,null,null,null,null,null,null,null,{"$error":"#N/A"},{"$error":"#N/A"},{"$f":"IF(AND(BP207=36,$BN$4>=35,$BN$4<=37),BP207&\"F\",0)","v":{"$error":"#N/A"}},null,null,{"$error":"#N/A"},{"$error":"#N/A"},{"$f":"IF(AND(BU207=36,$BS$4>=35,$BS$4<=37),BU207&\"F\",0)","v":{"$error":"#N/A"}}]
[null,null,null,null,null,null,null,null,null,null,null,null,null,null,null,null,null,null,null,null,null,null,null,null,null,null,null,"Right Stile",{"$f":"(Data!D907/12)*2","v":-0.20833333333333334},0.185,{"$f":"AC208*AD208","v":-3.8541666666666669E-2},null,null,null,null,null,null,null,null,{"$error":"#N/A"},{"$error":"#N/A"},{"$f":"IF(AND(AO208=41,$AM$4>=35,$AM$4<=38.99),AO208&\"-\"&\"6\",0)","v":{"$error":"#N/A"}},null,null,{"$error":"#N/A"},{"$error":"#N/A"},{"$f":"IF(AND(AT208=41,$AR$4>=35,$AR$4<=38.99),AT208&\"-\"&\"6\",0)","v":{"$error":"#N/A"}},null,null,null,null,null,null,null,null,null,null,null,null,null,null,null,null,null,null,null,{"$error":"#N/A"},{"$error":"#N/A"},{"$f":"IF(AND(BP208=36,$BN$4>=38,$BN$4<=40),BP208&\"G\",0)","v":{"$error":"#N/A"}},null,null,{"$error":"#N/A"},{"$error":"#N/A"},{"$f":"IF(AND(BU208=36,$BS$4>=38,$BS$4<=40),BU208&\"G\",0)","v":{"$error":"#N/A"}}]
[null,null,null,null,null,null,null,null,null,null,null,null,null,null,null,null,null,null,null,null,null,null,null,null,null,null,null,"Right Rail Reinf.",{"$f":"((AC206*12)-2.6875)/12","v":-0.41666666666666669},0.17199999999999999,{"$f":"AC209*AD209","v":-7.166666666666667E-2},null,null,null,null,null,null,null,null,{"$error":"#N/A"},{"$error":"#N/A"},{"$f":"IF(AND(AO209=41,$AM$4>=39,$AM$4<=41.99),AO209&\"-\"&\"9\",0)","v":{"$error":"#N/A"}},null,null,{"$error":"#N/A"},{"$error":"#N/A"},{"$f":"IF(AND(AT209=41,$AR$4>=39,$AR$4<=41.99),AT209&\"-\"&\"9\",0)","v":{"$error":"#N/A"}},"x",null,null,null,null,null,null,null,null,null,null,null,null,null,null,null,null,null,null,{"$error":"#N/A"},{"$error":"#N/A"},{"$f":"IF(AND(BP209=36,$BN$4>=41,$BN$4<=43),BP209&\"H\",0)","v":{"$error":"#N/A"}},null,null,{"$error":"#N/A"},{"$error":"#N/A"},{"$f":"IF(AND(BU209=36,$BS$4>=41,$BS$4<=43),BU209&\"H\",0)","v":{"$error":"#N/A"}}]
[null,null,null,null,null,null,null,null,null,null,null,null,null,null,null,null,null,null,null,null,null,null,null,null,null,null,null,"Right Stile Reinf",null,null,null,null,null,null,null,null,null,null,null,{"$error":"#N/A"},{"$error":"#N/A"},{"$f":"IF(AND(AO210=41,$AM$4>=42,$AM$4<=44.99),AO210&\"-\"&\"12\",0)","v":{"$error":"#N/A"}},null,null,{"$error":"#N/A"},{"$error":"#N/A"},{"$f":"IF(AND(AT210=41,$AR$4>=42,$AR$4<=44.99),AT210&\"-\"&\"12\",0)","v":{"$error":"#N/A"}},null,null,null,null,null,null,null,null,null,null,null,null,null,null,null,null,null,null,null,{"$error":"#N/A"},{"$error":"#N/A"},{"$f":"IF(AND(BP210=36,$BN$4>=44,$BN$4<=45),BP210&\"I\",0)","v":{"$error":"#N/A"}},null,null,{"$error":"#N/A"},{"$error":"#N/A"},{"$f":"IF(AND(BU210=36,$BS$4>=44,$BS$4<=45),BU210&\"I\",0)","v":{"$error":"#N/A"}}]
[null,null,null,null,null,null,null,null,null,null,null,null,null,null,null,null,null,null,null,null,null,null,null,null,null,null,null,"Right Glass",{"$f":"(((AC206*12)-2.5625)*((AC208*12)-2.5625))/144","v":0.17138671875},{"$f":"$H$10","v":2.3140000000000001},{"$f":"AC211*AD211","v":0.39658886718750003},null,null,null,null,null,null,null,null,{"$error":"#N/A"},{"$error":"#N/A"},{"$f":"IF(AND(AO211=41,$AM$4>=45,$AM$4<=47.99),AO211&\"-\"&\"13\",0)","v":{"$error":"#N/A"}},null,null,{"$error":"#N/A"},{"$error":"#N/A"},{"$f":"IF(AND(AT211=41,$AR$4>=45,$AR$4<=47.99),AT211&\"-\"&\"13\",0)","v":{"$error":"#N/A"}},null,null,null,null,null,null,null,null,null,null,null,null,null,null,null,null,null,null,null,{"$error":"#N/A"},{"$error":"#N/A"},{"$f":"IF(AND(BP211=36,$BN$4>=46,$BN$4<=54),\"Dbl.\"&BP211&\"C\",0)","v":{"$error":"#N/A"}},null,null,{"$error":"#N/A"},{"$error":"#N/A"},{"$f":"IF(AND(BU211=36,$BS$4>=46,$BS$4<=54),\"Dbl.\"&BU211&\"C\",0)","v":{"$error":"#N/A"}}]
[null,null,null,null,null,null,null,null,null,null,null,null,null,null,null,null,null,null,null,null,null,null,null,null,null,null,null,"Right Spacer",{"$f":"(((AC206*12)*2)+((AC208*12)*2))/12","v":-0.80208333333333337},5.3600000000000002E-2,-4.2991666666666671E-2,null,null,null,null,null,null,null,null,{"$error":"#N/A"},{"$error":"#N/A"},{"$f":"IF(AND(AO212=41,$AM$4>=48,$AM$4<=50.99),AO212&\"-\"&\"14\",0)","v":{"$error":"#N/A"}},null,null,{"$error":"#N/A"},{"$error":"#N/A"},{"$f":"IF(AND(AT212=41,$AR$4>=48,$AR$4<=50.99),AT212&\"-\"&\"14\",0)","v":{"$error":"#N/A"}},null,null,null,null,null,null,null,null,null,null,null,null,null,null,null,null,null,null,null,{"$error":"#N/A"},{"$error":"#N/A"},{"$f":"IF(AND(BP212=36,$BN$4>=55,$BN$4<=64),\"Dbl.\"&BP212&\"D\",0)","v":{"$error":"#N/A"}},null,null,{"$error":"#N/A"},{"$error":"#N/A"},{"$f":"IF(AND(BU212=36,$BS$4>=55,$BS$4<=64),\"Dbl.\"&BU212&\"D\",0)","v":{"$error":"#N/A"}}]
[null,null,null,null,null,null,null,null,null,null,null,null,null,null,null,null,null,null,null,null,null,null,null,null,null,null,null,"Right Hardware",1,0.36,0.36,null,null,null,null,null,null,null,null,{"$error":"#N/A"},{"$error":"#N/A"},{"$f":"IF(AND(AO213=41,$AM$4>=51,$AM$4<=53),AO213&\"-\"&\"15\",0)","v":{"$error":"#N/A"}},null,null,{"$error":"#N/A"},{"$error":"#N/A"},{"$f":"IF(AND(AT213=41,$AR$4>=51,$AR$4<=53),AT213&\"-\"&\"15\",0)","v":{"$error":"#N/A"}},null,null,null,null,null,null,null,null,null,null,null,null,null,null,null,null,null,null,null,{"$error":"#N/A"},{"$error":"#N/A"},{"$f":"IF(AND(BP213=36,$BN$4>=65,$BN$4<=68),\"Dbl.\"&BP213&\"E\",0)","v":{"$error":"#N/A"}},null,null,{"$error":"#N/A"},{"$error":"#N/A"},{"$f":"IF(AND(BU213=36,$BS$4>=65,$BS$4<=68),\"Dbl.\"&BU213&\"E\",0)","v":{"$error":"#N/A"}}]
[null,null,null,null,null,null,null,null,null,null,null,null,null,null,null,null,null,null,null,null,null,null,null,null,null,null,null,"Right Bead",{"$f":"((((AC206*12)-2.25)*2)+(((AC208*12)-2.25)*2))/12","v":-1.5520833333333333},1.9E-2,-2.9489583333333333E-2,null,null,null,null,null,null,null,null,{"$f":"IF(AND(AO214>0,AP214>0),AO214,0)","v":{"$error":"#N/A"}},{"$f":"IF(AND($AN$4<=43,$AN$4>41),43,0)","v":{"$error":"#N/A"}},{"$f":"IF(AND(AO214=43,$AM$4>=9,$AM$4<=12.99),AO214&\"-\"&\"1\",0)","v":{"$error":"#N/A"}},null,null,{"$error":"#N/A"},{"$f":"IF(AND($AS$4<=43,$AS$4>41),43,0)","v":{"$error":"#N/A"}},{"$f":"IF(AND(AT214=43,$AR$4>=9,$AR$4<=12.99),AT214&\"-\"&\"1\",0)","v":{"$error":"#N/A"}},null,null,null,null,null,null,null,null,null,null,null,null,null,null,null,null,null,null,null,{"$error":"#N/A"},{"$error":"#N/A"},{"$f":"IF(AND(BP214=36,$BN$4>=69,$BN$4<=74),\"Dbl.\"&BP214&\"F\",0)","v":{"$error":"#N/A"}},null,null,{"$error":"#N/A"},{"$error":"#N/A"},{"$f":"IF(AND(BU214=36,$BS$4>=69,$BS$4<=74),\"Dbl.\"&BU214&\"F\",0)","v":{"$error":"#N/A"}}]
[null,null,null,null,null,null,null,null,null,null,null,null,null,null,null,null,null,null,null,null,null,null,null,null,null,null,null,"Left Top Rail",{"$f":"Data!D905/12","v":-0.19270833333333334},0.24299999999999999,-4.6828124999999998E-2,null,null,null,null,null,null,null,null,{"$error":"#N/A"},{"$error":"#N/A"},{"$f":"IF(AND(AO215=43,$AM$4>=13,$AM$4<=17.99),AO215&\"-\"&\"2\",0)","v":{"$error":"#N/A"}},null,null,{"$error":"#N/A"},{"$error":"#N/A"},{"$f":"IF(AND(AT215=43,$AR$4>=13,$AR$4<=17.99),AT215&\"-\"&\"2\",0)","v":{"$error":"#N/A"}},null,null,null,null,null,null,null,null,null,null,null,null,null,null,null,null,null,null,null,{"$error":"#N/A"},{"$error":"#N/A"},{"$f":"IF(AND(BP215=36,$BN$4>=75,$BN$4<=80),\"Dbl.\"&BP215&\"G\",0)","v":{"$error":"#N/A"}},null,null,{"$error":"#N/A"},{"$error":"#N/A"},{"$f":"IF(AND(BU215=36,$BS$4>=75,$BS$4<=80),\"Dbl.\"&BU215&\"G\",0)","v":{"$error":"#N/A"}}]
[null,null,null,null,null,null,null,null,null,null,null,null,null,null,null,null,null,null,null,null,null,null,null,null,null,null,null,"Left Bottom Rail",{"$f":"Data!D905/12","v":-0.19270833333333334},0.216,-4.1625000000000002E-2,null,null,null,null,null,null,null,null,{"$error":"#N/A"},{"$error":"#N/A"},{"$f":"IF(AND(AO216=43,$AM$4>=18,$AM$4<=23.99),AO216&\"-\"&\"3\",0)","v":{"$error":"#N/A"}},null,null,{"$error":"#N/A"},{"$error":"#N/A"},{"$f":"IF(AND(AT216=43,$AR$4>=18,$AR$4<=23.99),AT216&\"-\"&\"3\",0)","v":{"$error":"#N/A"}},null,null,null,null,null,null,null,null,null,null,null,null,null,null,null,null,null,null,null,{"$error":"#N/A"},{"$f":"IF(AND($BO$4<=38,$BO$4>36),38,0)","v":{"$error":"#N/A"}},{"$f":"IF(AND(BP216=38,$BN$4>=11,$BN$4<=16),BP216&\"A\",0)","v":{"$error":"#N/A"}},null,null,{"$error":"#N/A"},{"$f":"IF(AND($BT$4<=38,$BT$4>36),38,0)","v":{"$error":"#N/A"}},{"$f":"IF(AND(BU216=38,$BS$4>=11,$BS$4<=16),BU216&\"A\",0)","v":{"$error":"#N/A"}}]
[null,null,null,null,null,null,null,null,null,null,null,null,null,null,null,null,null,null,null,null,null,null,null,null,null,null,null,"Left Stile",{"$f":"(Data!D907/12)*2","v":-0.20833333333333334},0.185,-3.8541666666666669E-2,null,null,null,null,null,null,null,null,{"$error":"#N/A"},{"$error":"#N/A"},{"$f":"IF(AND(AO217=43,$AM$4>=24,$AM$4<=28.99),AO217&\"-\"&\"4\",0)","v":{"$error":"#N/A"}},null,null,{"$error":"#N/A"},{"$error":"#N/A"},{"$f":"IF(AND(AT217=43,$AR$4>=24,$AR$4<=28.99),AT217&\"-\"&\"4\",0)","v":{"$error":"#N/A"}},null,null,null,null,null,null,null,null,null,null,null,null,null,null,null,null,null,null,null,{"$error":"#N/A"},{"$error":"#N/A"},{"$f":"IF(AND(BP217=38,$BN$4>=17,$BN$4<=22),BP217&\"B\",0)","v":{"$error":"#N/A"}},null,null,{"$error":"#N/A"},{"$error":"#N/A"},{"$f":"IF(AND(BU217=38,$BS$4>=17,$BS$4<=22),BU217&\"B\",0)","v":{"$error":"#N/A"}}]
[null,null,null,null,null,null,null,null,null,null,null,null,null,null,null,null,null,null,null,null,null,null,null,null,null,null,null,"Left Rail Reinf.",{"$f":"((AC215*12)-2.6875)/12","v":-0.41666666666666669},0.17199999999999999,-7.166666666666667E-2,null,null,null,null,null,null,null,null,{"$error":"#N/A"},{"$error":"#N/A"},{"$f":"IF(AND(AO218=43,$AM$4>=29,$AM$4<=34.99),AO218&\"-\"&\"5\",0)","v":{"$error":"#N/A"}},null,null,{"$error":"#N/A"},{"$error":"#N/A"},{"$f":"IF(AND(AT218=43,$AR$4>=29,$AR$4<=34.99),AT218&\"-\"&\"5\",0)","v":{"$error":"#N/A"}},null,null,null,null,null,null,null,null,null,null,null,null,null,null,null,null,null,null,null,{"$error":"#N/A"},{"$error":"#N/A"},{"$f":"IF(AND(BP218=38,$BN$4>=23,$BN$4<=27),BP218&\"C\",0)","v":{"$error":"#N/A"}},null,null,{"$error":"#N/A"},{"$error":"#N/A"},{"$f":"IF(AND(BU218=38,$BS$4>=23,$BS$4<=27),BU218&\"C\",0)","v":{"$error":"#N/A"}}]
[null,null,null,null,null,null,null,null,null,null,null,null,null,null,null,null,null,null,null,null,null,null,null,null,null,null,null,"Left Stile Reinf.",null,null,null,null,null,null,null,null,null,null,null,{"$error":"#N/A"},{"$error":"#N/A"},{"$f":"IF(AND(AO219=43,$AM$4>=35,$AM$4<=38.99),AO219&\"-\"&\"6\",0)","v":{"$error":"#N/A"}},null,null,{"$error":"#N/A"},{"$error":"#N/A"},{"$f":"IF(AND(AT219=43,$AR$4>=35,$AR$4<=38.99),AT219&\"-\"&\"6\",0)","v":{"$error":"#N/A"}},null,null,null,null,null,null,null,null,null,null,null,null,null,null,null,null,null,null,null,{"$error":"#N/A"},{"$error":"#N/A"},{"$f":"IF(AND(BP219=38,$BN$4>=28,$BN$4<=32),BP219&\"D\",0)","v":{"$error":"#N/A"}},null,null,{"$error":"#N/A"},{"$error":"#N/A"},{"$f":"IF(AND(BU219=38,$BS$4>=28,$BS$4<=32),BU219&\"D\",0)","v":{"$error":"#N/A"}}]
[null,null,null,null,null,null,null,null,null,null,null,null,null,null,null,null,null,null,null,null,null,null,null,null,null,null,null,"Left Glass",{"$f":"(((AC215*12)-2.5625)*((AC217*12)-2.5625))/144","v":0.17138671875},{"$f":"$H$10","v":2.3140000000000001},{"$f":"AC220*AD220","v":0.39658886718750003},null,null,null,null,null,null,null,null,{"$error":"#N/A"},{"$error":"#N/A"},{"$f":"IF(AND(AO220=43,$AM$4>=39,$AM$4<=41.99),AO220&\"-\"&\"9\",0)","v":{"$error":"#N/A"}},null,null,{"$error":"#N/A"},{"$error":"#N/A"},{"$f":"IF(AND(AT220=43,$AR$4>=39,$AR$4<=41.99),AT220&\"-\"&\"9\",0)","v":{"$error":"#N/A"}},null,null,null,null,null,null,null,null,null,null,null,null,null,null,null,null,null,null,null,{"$error":"#N/A"},{"$error":"#N/A"},{"$f":"IF(AND(BP220=38,$BN$4>=33,$BN$4<=34),BP220&\"E\",0)","v":{"$error":"#N/A"}},null,null,{"$error":"#N/A"},{"$error":"#N/A"},{"$f":"IF(AND(BU220=38,$BS$4>=33,$BS$4<=34),BU220&\"E\",0)","v":{"$error":"#N/A"}}]
[null,null,null,null,null,null,null,null,null,null,null,null,null,null,null,null,null,null,null,null,null,null,null,null,null,null,null,"Left Spacer",{"$f":"(((AC215*12)*2)+((AC217*12)*2))/12","v":-0.80208333333333337},5.3600000000000002E-2,{"$f":"AC221*AD221","v":-4.2991666666666671E-2},null,null,null,null,null,null,null,null,{"$error":"#N/A"},{"$error":"#N/A"},{"$f":"IF(AND(AO221=43,$AM$4>=42,$AM$4<=44.99),AO221&\"-\"&\"12\",0)","v":{"$error":"#N/A"}},null,null,{"$error":"#N/A"},{"$error":"#N/A"},{"$f":"IF(AND(AT221=43,$AR$4>=42,$AR$4<=44.99),AT221&\"-\"&\"12\",0)","v":{"$error":"#N/A"}},null,null,null,null,null,null,null,null,null,null,null,null,null,null,null,null,null,null,null,{"$error":"#N/A"},{"$error":"#N/A"},{"$f":"IF(AND(BP221=38,$BN$4>=35,$BN$4<=37),BP221&\"F\",0)","v":{"$error":"#N/A"}},null,null,{"$error":"#N/A"},{"$error":"#N/A"},{"$f":"IF(AND(BU221=38,$BS$4>=35,$BS$4<=37),BU221&\"F\",0)","v":{"$error":"#N/A"}}]
[null,null,null,null,null,null,null,null,null,null,null,null,null,null,null,null,null,null,null,null,null,null,null,null,null,null,null,"Left Hardware",1,0.36,{"$f":"AC222*AD222","v":0.36},null,null,null,null,null,null,null,null,{"$error":"#N/A"},{"$error":"#N/A"},{"$f":"IF(AND(AO222=43,$AM$4>=45,$AM$4<=47.99),AO222&\"-\"&\"13\",0)","v":{"$error":"#N/A"}},null,null,{"$error":"#N/A"},{"$error":"#N/A"},{"$f":"IF(AND(AT222=43,$AR$4>=45,$AR$4<=47.99),AT222&\"-\"&\"13\",0)","v":{"$error":"#N/A"}},null,null,null,null,null,null,null,null,null,null,null,null,null,null,null,null,null,null,null,{"$error":"#N/A"},{"$error":"#N/A"},{"$f":"IF(AND(BP222=38,$BN$4>=38,$BN$4<=40),BP222&\"G\",0)","v":{"$error":"#N/A"}},null,null,{"$error":"#N/A"},{"$error":"#N/A"},{"$f":"IF(AND(BU222=38,$BS$4>=38,$BS$4<=40),BU222&\"G\",0)","v":{"$error":"#N/A"}}]
[null,null,null,null,null,null,null,null,null,null,null,null,null,null,null,null,null,null,null,null,null,null,null,null,null,null,null,"Left Bead",{"$f":"((((AC215*12)-2.25)*2)+(((AC217*12)-2.25)*2))/12","v":-1.5520833333333333},1.9E-2,{"$f":"AC223*AD223","v":-2.9489583333333333E-2},null,null,null,null,null,null,null,null,{"$error":"#N/A"},{"$error":"#N/A"},{"$f":"IF(AND(AO223=43,$AM$4>=48,$AM$4<=50.99),AO223&\"-\"&\"14\",0)","v":{"$error":"#N/A"}},null,null,{"$error":"#N/A"},{"$error":"#N/A"},{"$f":"IF(AND(AT223=43,$AR$4>=48,$AR$4<=50.99),AT223&\"-\"&\"14\",0)","v":{"$error":"#N/A"}},null,null,null,null,null,null,null,null,null,null,null,null,null,null,null,null,null,null,null,{"$error":"#N/A"},{"$error":"#N/A"},{"$f":"IF(AND(BP223=38,$BN$4>=41,$BN$4<=43),BP223&\"H\",0)","v":{"$error":"#N/A"}},null,null,{"$error":"#N/A"},{"$error":"#N/A"},{"$f":"IF(AND(BU223=38,$BS$4>=41,$BS$4<=43),BU223&\"H\",0)","v":{"$error":"#N/A"}}]
[null,null,null,null,null,null,null,null,null,null,null,null,null,null,null,null,null,null,null,null,null,null,null,null,null,null,null,null,null,"Right Sash",{"$f":"IF(ModelNo=\"8SP3\",TRUNC(SUM(AE206:AE214)),0)","v":0},null,null,null,null,null,null,null,null,{"$error":"#N/A"},{"$error":"#N/A"},{"$f":"IF(AND(AO224=43,$AM$4>=51,$AM$4<=53),AO224&\"-\"&\"15\",0)","v":{"$error":"#N/A"}},null,null,{"$error":"#N/A"},{"$error":"#N/A"},{"$f":"IF(AND(AT224=43,$AR$4>=51,$AR$4<=53),AT224&\"-\"&\"15\",0)","v":{"$error":"#N/A"}},null,null,null,null,null,null,null,null,null,null,null,null,null,null,null,null,null,null,null,{"$error":"#N/A"},{"$error":"#N/A"},{"$f":"IF(AND(BP224=38,$BN$4>=44,$BN$4<=45),BP224&\"I\",0)","v":{"$error":"#N/A"}},null,null,{"$error":"#N/A"},{"$error":"#N/A"},{"$f":"IF(AND(BU224=38,$BS$4>=44,$BS$4<=45),BU224&\"I\",0)","v":{"$error":"#N/A"}}]
[null,null,null,null,null,null,null,null,null,null,null,null,null,null,null,null,null,null,null,null,null,null,null,null,null,null,null,null,null,"Left Sash",{"$f":"IF(ModelNo=\"8SP3\",TRUNC(SUM(AE215:AE223)),0)","v":0},null,null,null,null,null,null,null,null,{"$f":"IF(AND(AO225>0,AP225>0),AO225,0)","v":{"$error":"#N/A"}},{"$f":"IF(AND($AN$4<=45,$AN$4>43),45,0)","v":{"$error":"#N/A"}},{"$f":"IF(AND(AO225=45,$AM$4>=9,$AM$4<=12.99),AO225&\"-\"&\"1\",0)","v":{"$error":"#N/A"}},null,null,{"$error":"#N/A"},{"$f":"IF(AND($AS$4<=45,$AS$4>43),45,0)","v":{"$error":"#N/A"}},{"$f":"IF(AND(AT225=45,$AR$4>=9,$AR$4<=12.99),AT225&\"-\"&\"1\",0)","v":{"$error":"#N/A"}},null,null,null,null,null,null,null,null,null,null,null,null,null,null,null,null,null,null,null,{"$error":"#N/A"},{"$error":"#N/A"},{"$f":"IF(AND(BP225=38,$BN$4>=46,$BN$4<=54),\"Dbl.\"&BP225&\"C\",0)","v":{"$error":"#N/A"}},null,null,{"$error":"#N/A"},{"$error":"#N/A"},{"$f":"IF(AND(BU225=38,$BS$4>=46,$BS$4<=54),\"Dbl.\"&BU225&\"C\",0)","v":{"$error":"#N/A"}}]
[null,null,null,null,null,null,null,null,null,null,null,null,null,null,null,null,null,null,null,null,null,null,null,null,null,null,null,null,null,null,null,null,null,null,null,null,null,null,null,{"$error":"#N/A"},{"$error":"#N/A"},{"$f":"IF(AND(AO226=45,$AM$4>=13,$AM$4<=17.99),AO226&\"-\"&\"2\",0)","v":{"$error":"#N/A"}},null,null,{"$error":"#N/A"},{"$error":"#N/A"},{"$f":"IF(AND(AT226=45,$AR$4>=13,$AR$4<=17.99),AT226&\"-\"&\"2\",0)","v":{"$error":"#N/A"}},null,null,null,null,null,null,null,null,null,null,null,null,null,null,null,null,null,null,null,{"$error":"#N/A"},{"$error":"#N/A"},{"$f":"IF(AND(BP226=38,$BN$4>=55,$BN$4<=64),\"Dbl.\"&BP226&\"D\",0)","v":{"$error":"#N/A"}},null,null,{"$error":"#N/A"},{"$error":"#N/A"},{"$f":"IF(AND(BU226=38,$BS$4>=55,$BS$4<=64),\"Dbl.\"&BU226&\"D\",0)","v":{"$error":"#N/A"}}]
[null,null,null,null,null,null,null,null,null,null,null,null,null,null,null,null,null,null,null,null,null,null,null,null,null,null,null,null,null,null,null,null,null,null,null,null,null,null,null,{"$error":"#N/A"},{"$error":"#N/A"},{"$f":"IF(AND(AO227=45,$AM$4>=18,$AM$4<=23.99),AO227&\"-\"&\"3\",0)","v":{"$error":"#N/A"}},null,null,{"$error":"#N/A"},{"$error":"#N/A"},{"$f":"IF(AND(AT227=45,$AR$4>=18,$AR$4<=23.99),AT227&\"-\"&\"3\",0)","v":{"$error":"#N/A"}},null,null,null,null,null,null,null,null,null,null,null,null,null,null,null,null,null,null,null,{"$error":"#N/A"},{"$error":"#N/A"},{"$f":"IF(AND(BP227=38,$BN$4>=65,$BN$4<=68),\"Dbl.\"&BP227&\"E\",0)","v":{"$error":"#N/A"}},null,null,{"$error":"#N/A"},{"$error":"#N/A"},{"$f":"IF(AND(BU227=38,$BS$4>=65,$BS$4<=68),\"Dbl.\"&BU227&\"E\",0)","v":{"$error":"#N/A"}}]
[null,null,null,null,null,null,null,null,null,null,null,null,null,null,null,null,null,null,null,null,null,null,null,null,null,null,null,null,null,null,null,null,null,null,null,null,null,null,null,{"$error":"#N/A"},{"$error":"#N/A"},{"$f":"IF(AND(AO228=45,$AM$4>=24,$AM$4<=28.99),AO228&\"-\"&\"4\",0)","v":{"$error":"#N/A"}},null,null,{"$error":"#N/A"},{"$error":"#N/A"},{"$f":"IF(AND(AT228=45,$AR$4>=24,$AR$4<=28.99),AT228&\"-\"&\"4\",0)","v":{"$error":"#N/A"}},null,null,null,null,null,null,null,null,null,null,null,null,null,null,null,null,null,null,null,{"$f":"IF(AND(BP228>0,BQ228>0),BP228,0)","v":{"$error":"#N/A"}},{"$error":"#N/A"},{"$f":"IF(AND(BP228=38,$BN$4>=69,$BN$4<=74),\"Dbl.\"&BP228&\"F\",0)","v":{"$error":"#N/A"}},null,null,{"$error":"#N/A"},{"$error":"#N/A"},{"$f":"IF(AND(BU228=38,$BS$4>=69,$BS$4<=74),\"Dbl.\"&BU228&\"F\",0)","v":{"$error":"#N/A"}}]
[null,null,null,null,null,null,null,null,null,null,null,null,null,null,null,null,null,null,null,null,null,null,null,null,null,null,null,null,null,null,null,null,null,null,null,null,null,null,null,{"$error":"#N/A"},{"$error":"#N/A"},{"$f":"IF(AND(AO229=45,$AM$4>=29,$AM$4<=34.99),AO229&\"-\"&\"5\",0)","v":{"$error":"#N/A"}},null,null,{"$error":"#N/A"},{"$error":"#N/A"},{"$f":"IF(AND(AT229=45,$AR$4>=29,$AR$4<=34.99),AT229&\"-\"&\"5\",0)","v":{"$error":"#N/A"}},null,null,null,null,null,null,null,null,null,null,null,null,null,null,null,null,null,null,null,{"$f":"IF(AND(BP229>0,BQ229>0),BP229,0)","v":{"$error":"#N/A"}},{"$error":"#N/A"},{"$f":"IF(AND(BP229=38,$BN$4>=75,$BN$4<=80),\"Dbl.\"&BP229&\"G\",0)","v":{"$error":"#N/A"}},null,null,{"$error":"#N/A"},{"$error":"#N/A"},{"$f":"IF(AND(BU229=38,$BS$4>=75,$BS$4<=80),\"Dbl.\"&BU229&\"G\",0)","v":{"$error":"#N/A"}}]
[null,null,null,null,null,null,null,null,null,null,null,null,null,null,null,null,null,null,null,null,null,null,null,null,null,null,null,null,null,null,null,null,null,null,null,null,null,null,null,{"$error":"#N/A"},{"$error":"#N/A"},{"$f":"IF(AND(AO230=45,$AM$4>=35,$AM$4<=38.99),AO230&\"-\"&\"6\",0)","v":{"$error":"#N/A"}},null,null,{"$error":"#N/A"},{"$error":"#N/A"},{"$f":"IF(AND(AT230=45,$AR$4>=35,$AR$4<=38.99),AT230&\"-\"&\"6\",0)","v":{"$error":"#N/A"}}]
[null,null,null,null,null,null,null,null,null,null,null,null,null,null,null,null,null,null,null,null,null,null,null,null,null,null,null,null,null,null,null,null,null,null,null,null,null,null,null,{"$error":"#N/A"},{"$error":"#N/A"},{"$f":"IF(AND(AO231=45,$AM$4>=39,$AM$4<=41.99),AO231&\"-\"&\"9\",0)","v":{"$error":"#N/A"}},null,null,{"$error":"#N/A"},{"$error":"#N/A"},{"$f":"IF(AND(AT231=45,$AR$4>=39,$AR$4<=41.99),AT231&\"-\"&\"9\",0)","v":{"$error":"#N/A"}}]
[null,null,null,null,null,null,null,null,null,null,null,null,null,null,null,null,null,null,null,null,null,null,null,null,null,null,null,null,null,null,null,null,null,null,null,null,null,null,null,{"$error":"#N/A"},{"$error":"#N/A"},{"$f":"IF(AND(AO232=45,$AM$4>=42,$AM$4<=44.99),AO232&\"-\"&\"12\",0)","v":{"$error":"#N/A"}},null,null,{"$error":"#N/A"},{"$error":"#N/A"},{"$f":"IF(AND(AT232=45,$AR$4>=42,$AR$4<=44.99),AT232&\"-\"&\"12\",0)","v":{"$error":"#N/A"}}]
[null,null,null,null,null,null,null,null,null,null,null,null,null,null,null,null,null,null,null,null,null,null,null,null,null,null,null,null,null,null,null,null,null,null,null,null,null,null,null,{"$error":"#N/A"},{"$error":"#N/A"},{"$f":"IF(AND(AO233=45,$AM$4>=45,$AM$4<=47.99),AO233&\"-\"&\"13\",0)","v":{"$error":"#N/A"}},null,null,{"$error":"#N/A"},{"$error":"#N/A"},{"$f":"IF(AND(AT233=45,$AR$4>=45,$AR$4<=47.99),AT233&\"-\"&\"13\",0)","v":{"$error":"#N/A"}}]
[null,null,null,null,null,null,null,null,null,null,null,null,null,null,null,null,null,null,null,null,null,null,null,null,null,null,null,null,null,null,null,null,null,null,null,null,null,null,null,{"$error":"#N/A"},{"$error":"#N/A"},{"$f":"IF(AND(AO234=45,$AM$4>=48,$AM$4<=50.99),AO234&\"-\"&\"14\",0)","v":{"$error":"#N/A"}},null,null,{"$error":"#N/A"},{"$error":"#N/A"},{"$f":"IF(AND(AT234=45,$AR$4>=48,$AR$4<=50.99),AT234&\"-\"&\"14\",0)","v":{"$error":"#N/A"}}]
[null,null,null,null,null,null,null,null,null,null,null,null,null,null,null,null,null,null,null,null,null,null,null,null,null,null,null,null,null,null,null,null,null,null,null,null,null,null,null,{"$error":"#N/A"},{"$error":"#N/A"},{"$f":"IF(AND(AO235=45,$AM$4>=51,$AM$4<=53),AO235&\"-\"&\"15\",0)","v":{"$error":"#N/A"}},null,null,{"$error":"#N/A"},{"$error":"#N/A"},{"$f":"IF(AND(AT235=45,$AR$4>=51,$AR$4<=53),AT235&\"-\"&\"15\",0)","v":{"$error":"#N/A"}}]

{"sheet":"CMR","index":2,"n_rows":96,"n_cols":37,"rows_kept":96,"cut":false,"hidden":true,"merged":[[61,8,61,10],[30,16,30,18],[46,16,46,18],[31,16,31,18],[79,8,79,10],[49,11,49,12],[47,8,47,10],[13,1,13,3],[13,8,13,10],[14,8,14,10],[15,8,15,10],[26,8,26,9],[9,1,9,2],[10,1,10,2],[10,8,10,9],[12,8,12,10],[9,8,9,9],[12,1,12,3],[65,11,65,12],[62,8,62,10],[63,8,63,10],[1,4,1,5],[1,11,1,12],[42,8,42,9],[44,8,44,10],[45,8,45,10],[46,8,46,10],[41,8,41,9],[28,8,28,10],[29,8,29,10],[17,11,17,12],[33,11,33,12],[25,8,25,9],[30,8,30,10],[14,1,14,3],[15,1,15,3],[57,8,57,9],[58,8,58,9],[60,8,60,10],[31,8,31,10],[77,8,77,10],[78,8,78,10],[73,8,73,9],[74,8,74,9],[76,8,76,10],[93,8,93,10],[94,8,94,10],[95,8,95,10],[81,11,81,12],[89,8,89,9],[90,8,90,9],[92,8,92,10],[29,16,29,18],[1,19,1,20],[9,16,9,17],[10,16,10,17],[12,16,12,18],[13,16,13,18],[14,16,14,18],[15,16,15,18],[17,19,17,20],[25,16,25,17],[26,16,26,17],[28,16,28,18],[62,16,62,18],[63,16,63,18],[65,19,65,20],[81,19,81,20],[33,19,33,20],[41,16,41,17],[42,16,42,17],[44,16,44,18],[45,16,45,18],[47,16,47,18],[49,19,49,20],[57,16,57,17],[58,16,58,17],[60,16,60,18],[61,16,61,18],[94,16,94,18],[95,16,95,18],[73,16,73,17],[74,16,74,17],[76,16,76,18],[77,16,77,18],[78,16,78,18],[79,16,79,18],[92,16,92,18],[89,16,89,17],[93,16,93,18],[90,16,90,17]]}
[]
[null,null,"W",null,"A201",null,null,null,null,"W",null,"A140, A144, A146",null,null,"Frame Cut Leg",{"$f":"LEG+6","v":6},null,"W",null,"3A01"]
[null,null,{"$f":"IF(TYPE=1,C2,IF(TYPE= \"\",C2,\" \"))","v":"W"},1,{"$f":"Frame_Height/2","v":0},{"$f":"TRUNC(E3*16+0.5)/16","v":0},null,null,null,{"$f":"IF(TYPE=1,$J2,IF(TYPE= \"\",$J2,\" \"))","v":"W"},1,{"$f":"Frame_Height/2-CMRD","v":6},{"$f":"TRUNC(L3*16+0.5)/16","v":6},null,"CMRD",{"$f":"Frame_Height-P2","v":-6},null,{"$f":"IF(TYPE=1,R2,IF(TYPE= \"\",R2,\" \"))","v":"W"},1,{"$f":"Frame_Height/2","v":0},{"$f":"TRUNC(T3*16+0.5)/16","v":0},null,null,null,null,null,"Model","TSW","TSH","TGW","TGH","TGSF","BSW","BSH","BGW","BGH","BGSF"]
[null,null,{"$f":"IF(TYPE=5,C2,IF(TYPE=2,IF(Frame_Height>=54.5,IF(Frame_Height<72.5,C2,\"\"),\"\"),\"\"))","v":""},2,{"$f":"INT((Frame_Height/5)*48+0.5)/16","v":0},0,5,null,null,{"$f":"IF(TYPE=5,$J2,IF(TYPE=2,IF(Frame_Height>=54.5,IF(Frame_Height<72.5,$J2,\"\"),\"\"),\"\"))","v":""},2,{"$f":"INT((Frame_Height/5)*48+0.5)/16-CMRD","v":6},6,5,"Sash Cut back",null,null,{"$f":"IF(TYPE=5,R2,IF(TYPE=2,IF(Frame_Height>=54.5,IF(Frame_Height<72.5,R2,\"\"),\"\"),\"\"))","v":""},2,{"$f":"INT((Frame_Height/5)*48+0.5)/16","v":0},0,5,null,null,null,null,"A201",{"$f":"Data!D2","v":-3.25},{"$f":"Data!D3","v":-1.5625},{"$f":"Data!D6","v":-4.875},{"$f":"Data!D7","v":-3.1875},{"$f":"(AD4*AE4)/144","v":0.10791015625},{"$f":"Data!D4","v":-2.25},{"$f":"Data!D5","v":-0.5625},{"$f":"Data!D8","v":-3.875},{"$f":"Data!D9","v":-2.1875},{"$f":"(AI4*AJ4)/144","v":5.8865017361111112E-2}]
[null,null,{"$f":"IF(TYPE=6,C2,IF(AND(TYPE=2,OR(Frame_Height<54.5,Frame_Height>=72.5)),C2,\"\"))","v":""},null,{"$f":"INT((Frame_Height/3-0.22)*32+0.5)/16","v":-0.4375},-0.375,6,null,null,{"$f":"IF(TYPE=6,$J2,IF(AND(TYPE=2,OR(Frame_Height<54.5,Frame_Height>=72.5)),$J2,\"\"))","v":""},null,{"$f":"INT((Frame_Height/3-0.22)*32+0.5)/16-CMRD","v":5.5625},5.5625,6,null,null,null,{"$f":"IF(TYPE=6,R2,IF(AND(TYPE=2,OR(Frame_Height<54.5,Frame_Height>=72.5)),R2,\"\"))","v":""},null,{"$f":"INT((Frame_Height/3-0.22)*32+0.5)/16","v":-0.4375},-0.375,6,null,null,null,null,"A571",null,null,null,null,null,{"$f":"Data!D156","v":-2.125},{"$f":"Data!D157","v":-0.875},{"$f":"Data!D158","v":-4.3125},{"$f":"Data!D159","v":-3.0625},9.1715494791666671E-2]
[null,null,{"$f":"IF(TYPE=7,C2,IF(TYPE=3,IF(Frame_Height>=54.5,IF(Frame_Height<72.5,C2,\"\"),\"\"),\"\"))","v":""},3,{"$f":"INT((Frame_Height/5+0.55)*32+0.5)/16","v":1.125},1.125,7,null,null,{"$f":"IF(TYPE=7,$J2,IF(TYPE=3,IF(Frame_Height>=54.5,IF(Frame_Height<72.5,$J2,\"\"),\"\"),\"\"))","v":""},3,{"$f":"INT((Frame_Height/5+0.55)*32+0.5)/16-CMRD","v":7.125},7.125,7,null,null,null,{"$f":"IF(TYPE=7,R2,IF(TYPE=3,IF(Frame_Height>=54.5,IF(Frame_Height<72.5,R2,\"\"),\"\"),\"\"))","v":""},3,{"$f":"INT((Frame_Height/5+0.55)*32+0.5)/16","v":1.125},1.125,7,null,null,null,null,"A581",null,null,null,null,null,{"$f":"Data!D174","v":-2.8125},{"$f":"Data!D175","v":-1.5},{"$f":"Data!D176","v":-5.375},{"$f":"Data!D177","v":-4.0625},0.1516384548611111]
[null,null,{"$f":"IF(TYPE=8,C2,IF(AND(TYPE=3,OR(Frame_Height<54.5,Frame_Height>=72.5)),C2,\"\"))","v":""},null,{"$f":"INT((Frame_Height/3+1.4)*16+0.5)/16","v":1.375},1.375,8,null,null,{"$f":"IF(TYPE=8,$J2,IF(AND(TYPE=3,OR(Frame_Height<54.5,Frame_Height>=72.5)),$J2,\"\"))","v":""},null,{"$f":"INT((Frame_Height/3+1.4)*16+0.5)/16-CMRD","v":7.375},7.375,8,null,null,null,{"$f":"IF(TYPE=8,R2,IF(AND(TYPE=3,OR(Frame_Height<54.5,Frame_Height>=72.5)),R2,\"\"))","v":""},null,{"$f":"INT((Frame_Height/3+1.4)*16+0.5)/16","v":1.375},1.375,8,null,null,null,null,"A991",null,null,null,null,null,{"$f":"Data!D274","v":-2.8125},{"$f":"Data!D275","v":-1.5},{"$f":"Data!D276","v":-5.375},{"$f":"Data!D277","v":-4.0625},0.1516384548611111]
[null,null,{"$f":"IF(TYPE=4,C2,\"\")","v":""},4,{"$f":"Frame_Height-CMR","v":0},0,null,null,null,{"$f":"IF(TYPE=4,$J2,\"\")","v":""},4,{"$f":"CMR-CMRD","v":6},6,null,null,null,null,{"$f":"IF(TYPE=4,R2,\"\")","v":""},4,{"$f":"Frame_Height-CMR","v":0},0,null,null,null,null,null,"A501",{"$f":"Data!D363","v":-4.875},{"$f":"Data!D364","v":-1.65625},{"$f":"Data!D367","v":-6.6875},{"$f":"Data!D368","v":-3.46875},{"$f":"(AD8*AE8)/144","v":0.16109212239583334},{"$f":"Data!D365","v":-3.875},{"$f":"Data!D366","v":-0.65625},{"$f":"Data!D369","v":-6.6875},{"$f":"Data!D370","v":-3.46875},0.16109212239583334]
[null,null,null,null,null,null,null,null,null,null,null,null,null,null,null,null,null,null,null,null,null,null,null,null,null,null,"02S0",null,null,null,null,null,{"$f":"Data!D460","v":-2.25},{"$f":"Data!D461","v":-0.75},{"$f":"Data!D462","v":-3.875},{"$f":"Data!D463","v":-2.375},6.3910590277777776E-2]
[null,"Dim.,\"D\"",null,"=",{"$f":"IF(C3=C2,F3,IF(C4=C2,F4,IF(C5=C2,F5,IF(C6=C2,F6,IF(C7=C2,F7,IF(C8=C2,F8,F3))))))","v":0},null,null,null,"Dim.,\"D\"",null,"=",{"$f":"IF(TYPE=2,Frame_Height-CDIMA140,Frame_Height/2-CMRD)","v":6},"CMR Diff",{"$f":"Frame_Height-(LEG+6)","v":-6},null,null,"Dim.,\"D\"",null,"=",{"$f":"IF(R3=R2,U3,IF(R4=R2,U4,IF(R5=R2,U5,IF(R6=R2,U6,IF(R7=R2,U7,IF(R8=R2,U8,U3))))))","v":0},null,null,null,null,null,null,"3A01",{"$f":"Data!D548","v":-4.125},{"$f":"Data!D549","v":-1.625},{"$f":"Data!D552","v":-5.75},{"$f":"Data!D553","v":-3.21875},{"$f":"(AD10*AE10)/144","v":0.12852647569444445},{"$f":"Data!D550","v":-3.125},{"$f":"Data!D551","v":-0.625},{"$f":"Data!D554","v":-4.75},{"$f":"Data!D555","v":-2.21875},7.3187934027777776E-2]
[null,"Dim.,\"C\"",null,"=",{"$f":"Frame_Height-E10","v":0},null,null,null,"Dim.,\"C\"",null,"=",{"$f":"IF(TYPE=2,CMR,P2-DDIMA140)","v":0},null,null,null,null,"Dim.,\"C\"",null,"=",{"$f":"TRUNC((Frame_Height-T10)*32+0.5)/32","v":0},null,null,null,null,null,null,"03S0",null,null,null,null,null,{"$f":"Data!D607","v":-3.125},{"$f":"Data!D608","v":-1.125},{"$f":"Data!D609","v":-4.75},{"$f":"Data!D610","v":-2.71875},8.9680989583333329E-2]
[null,null,null,null,null,null,null,null,null,null,null,null,"Fraem R:",{"$f":"IF(ModelNo=\"A146\",((Frame_Height-LEG)/2)+(((Frame_Width*2)^2)/(8*(Frame_Height-LEG))),((Frame_Height-LEG)/2)+((Frame_Width^2)/(8*(Frame_Height-LEG))))","v":{"$error":"#DIV/0!"}},null,null,null,null,null,null,null,null,null,null,null,null,"A140",null,null,null,null,null,{"$f":"Data!D662","v":-3.125},{"$f":"Data!D663","v":-1.125},{"$f":"Data!D664","v":-4.8125},{"$f":"Data!D665","v":-2.75},9.1905381944444448E-2]
[null,"Top Glass Width",null,null,{"$f":"TRUNC((Frame_Width-4.90625)*32+0.5)/32","v":-4.875},null,null,null,"Top Glass Width",null,null,{"$f":"TRUNC((Frame_Width-2*EXT)*16+0.5)/16","v":0},"Glass R:",{"$f":"N12-EXT","v":{"$error":"#DIV/0!"}},"F",{"$f":"IF(Frame_Width>=(Frame_Height-LEG),2*(ASIN((EXT*2)/(2*N13))),2*(ASIN(((N13-(Frame_Width-2*EXT))*2)/(2*N13))))","v":{"$error":"#DIV/0!"}},"Top Glass Width",null,null,{"$f":"TRUNC((Frame_Width-5.8125)*16+0.5)/16","v":-5.75},null,null,null,null,null,null,"A740"]
[null,"Bottom Glass Width",null,null,{"$f":"TRUNC((Frame_Width-3.90625)*32+0.5)/32","v":-3.875},null,null,null,"Bottom Glass Width",null,null,{"$f":"IF(OR(EXTSELECT=2,EXTSELECT=3),T30,0)","v":0}," Glass h:",{"$f":"IF(ModelNo=\"A146\",N13-(SQRT((4*N13^2)-(L13*2+(2*EXT))^2))/2,N13-(SQRT((4*N13^2)-(L13)^2)/2))","v":{"$error":"#DIV/0!"}},"d",{"$f":"N13*COS(P13/2)","v":{"$error":"#DIV/0!"}},"Bottom Glass Width",null,null,{"$f":"TRUNC((Frame_Width-4.8125)*16+0.5)/16","v":-4.75},null,null,null,null,null,null,"A840"]
[null,"Top Glass Height",null,null,{"$f":"TRUNC((E10-3.21875)*32+0.5)/32","v":-3.1875},null,null,null,"Top Glass Height",null,null,{"$f":"IF(ModelNo=\"A146\",Frame_Height-($L$11+$N$15+EXT+P15),Frame_Height-($L$11+N15+EXT))","v":-0.26400000000000001},null,0.26400000000000001,"h",{"$f":"N13-P14","v":{"$error":"#DIV/0!"}},"Top Glass Height",null,null,{"$f":"TRUNC((T10-3.25)*32+0.5)/32","v":-3.21875},null,null,null,null,null,null,{"$f":"ModelNo","v":"Select Model"},{"$f":"VLOOKUP(ModelNo,ORL_LIMIT,2,FALSE)","v":{"$error":"#N/A"}},{"$f":"VLOOKUP(ModelNo,ORL_LIMIT,3,FALSE)","v":{"$error":"#N/A"}},{"$f":"VLOOKUP(ModelNo,ORL_LIMIT,4,FALSE)","v":{"$error":"#N/A"}},{"$f":"VLOOKUP(ModelNo,ORL_LIMIT,5,FALSE)","v":{"$error":"#N/A"}},{"$f":"VLOOKUP(ModelNo,ORL_LIMIT,6,FALSE)","v":{"$error":"#N/A"}},{"$f":"VLOOKUP(ModelNo,ORL_LIMIT,7,FALSE)","v":{"$error":"#N/A"}},{"$f":"VLOOKUP(ModelNo,ORL_LIMIT,8,FALSE)","v":{"$error":"#N/A"}},{"$f":"VLOOKUP(ModelNo,ORL_LIMIT,9,FALSE)","v":{"$error":"#N/A"}},{"$f":"VLOOKUP(ModelNo,ORL_LIMIT,10,FALSE)","v":{"$error":"#N/A"}},{"$f":"VLOOKUP(ModelNo,ORL_LIMIT,11,FALSE)","v":{"$error":"#N/A"}}]
[null,"Bottom Glass Height",null,null,{"$f":"TRUNC((E11-2.21875)*32+0.5)/32","v":-2.1875},null,null,null,"Bottom Glass Height",null,null,{"$f":"IF(OR(EXTSELECT=2,EXTSELECT=3),T32,0)","v":0},"Top Glass Leg:",{"$f":"IF(ModelNo=\"A146\",L15-N14+P15,L15-N14)","v":{"$error":"#DIV/0!"}},null,null,"Bottom Glass Height",null,null,{"$f":"TRUNC((T11-2.25)*32+0.5)/32","v":-2.21875},null,null,null,null,null,null,{"$f":"IF(OR(TSH>50,BSH>50),\"SH MUST BE < 50\",\"\")","v":{"$error":"#N/A"}}]
[null,null,null,null,null,null,null,null,null,null,null,null,null,null,null,null,null,null,null,null,null,null,null,null,null,null,{"$f":"IF(AND(OR(Glass<4,Glass>5),OR(TGSF>15,BGSF>15)),\"GLASS MUST BE < 15 SF\",IF(AND(OR(Glass=4,Glass=5),OR(TGSF>11,BGSF>11)),\"GLASS MUST BE <11 SF\",\"\"))","v":{"$error":"#N/A"}}]
[null,{"$f":"ModelNo","v":"Select Model"},{"$f":"IF(ISERROR(VLOOKUP(ModelNo,B20:E57,4,FALSE)),\"\",VLOOKUP(ModelNo,B20:E57,4,FALSE))","v":""},null,null,null,null,null,null,"W",null,"02A0",null,null,null,null,null,"W",null,"03S0"]
[null,"Model","CDIM","DDIM",null,null,null,null,null,{"$f":"IF(TYPE=1,J18,IF(TYPE= \"\",J18,\" \"))","v":"W"},1,{"$f":"Frame_Height/2","v":0},{"$f":"TRUNC(L19*16+0.5)/16","v":0},null,null,null,null,{"$f":"IF(TYPE=1,R18,IF(TYPE= \"\",R18,\" \"))","v":"W"},1,{"$f":"Frame_Height/2","v":0},{"$f":"TRUNC(T19*16+0.5)/16","v":0}]
[null,"A201",{"$f":"E11","v":0},{"$f":"E10","v":0},null,null,null,null,null,{"$f":"IF(TYPE=5,J18,IF(TYPE=2,IF(Frame_Height>=54.5,IF(Frame_Height<72.5,J18,\"\"),\"\"),\"\"))","v":""},2,{"$f":"INT((Frame_Height/5)*48+0.5)/16","v":0},0,5,null,null,null,{"$f":"IF(TYPE=5,R18,IF(TYPE=2,IF(Frame_Height>=54.5,IF(Frame_Height<72.5,R18,\"\"),\"\"),\"\"))","v":""},2,{"$f":"INT((Frame_Height/5)*48+0.5)/16","v":0},0,5]
[null,"A272",{"$f":"IF(TYPE=1,TRUNC(((Frame_Width/2))*16+0.5)/16,IF(TYPE=2,CMR-0.25))","v":0},{"$f":"Frame_Width-A272CDIM","v":0},{"$f":"IF(AND(W>0,H>0,BTYPE=\"Custom\",CMR=0),\"<< Enter CMR Location\",IF(AND(W>0,H>0,BTYPE=\"Custom\"),\"<< CMR, Left to Right\",\"\"))","v":""},null,null,null,null,{"$f":"IF(TYPE=6,J18,IF(AND(TYPE=2,OR(Frame_Height<54.5,Frame_Height>=72.5)),J18,\"\"))","v":""},null,{"$f":"INT((Frame_Height/3-0.22)*32+0.5)/16","v":-0.4375},-0.375,6,null,null,null,{"$f":"IF(TYPE=6,R18,IF(AND(TYPE=2,OR(Frame_Height<54.5,Frame_Height>=72.5)),R18,\"\"))","v":""},null,{"$f":"INT((Frame_Height/3-0.22)*32+0.5)/16","v":-0.4375},-0.375,6]
[null,"A273",{"$f":"IF(TYPE=1,TRUNC(((W/4)-0.25)*16+0.5)/16,IF(TYPE=2,TRUNC(((W/3)-0.25)*16+0.5)/16,IF(TYPE=3,TRUNC((CMR-0.25)*16+0.5)/16,0)))","v":-0.1875},{"$f":"TRUNC((Frame_Width-(A273CDIM*2))*16+0.5)/16","v":0.375},{"$f":"IF(AND(W>0,H>0,BTYPE=\"Custom\",CMR=0),\"<< Enter CMR Location\",IF(AND(W>0,H>0,BTYPE=\"Custom\"),\"<< CMR, Ends to M.R\",\"\"))","v":""},null,null,null,null,{"$f":"IF(TYPE=7,J18,IF(TYPE=3,IF(Frame_Height>=54.5,IF(Frame_Height<72.5,J18,\"\"),\"\"),\"\"))","v":""},3,{"$f":"INT((Frame_Height/5+0.55)*32+0.5)/16","v":1.125},1.125,7,null,null,null,{"$f":"IF(TYPE=7,R18,IF(TYPE=3,IF(Frame_Height>=54.5,IF(Frame_Height<72.5,R18,\"\"),\"\"),\"\"))","v":""},3,{"$f":"INT((Frame_Height/5+0.55)*32+0.5)/16","v":1.125},1.125,7]
[null,"A282",{"$f":"IF(TYPE=1,TRUNC((Frame_Width/2)*16+0.5)/16,IF(TYPE=2,TRUNC((CMR-0.25)*32+0.5)/32,0))","v":0},{"$f":"Frame_Width-A282CDIM","v":0},{"$f":"IF(AND(W>0,H>0,BTYPE=\"Custom\",CMR=0),\"<< Enter CMR Location\",IF(AND(W>0,H>0,BTYPE=\"Custom\"),\"<< CMR, Left to Right\",\"\"))","v":""},null,null,null,null,{"$f":"IF(TYPE=8,J18,IF(AND(TYPE=3,OR(Frame_Height<54.5,Frame_Height>=72.5)),J18,\"\"))","v":""},null,{"$f":"INT((Frame_Height/3+1.4)*16+0.5)/16","v":1.375},1.375,8,null,null,null,{"$f":"IF(TYPE=8,R18,IF(AND(TYPE=3,OR(Frame_Height<54.5,Frame_Height>=72.5)),R18,\"\"))","v":""},null,{"$f":"INT((Frame_Height/3+1.4)*16+0.5)/16","v":1.375},1.375,8]
[null,"A283",{"$f":"IF(TYPE=1,TRUNC(((W/4)-0.25)*16+0.5)/16,IF(TYPE=2,TRUNC(((W/3)-0.25)*16+0.5)/16,IF(TYPE=3,TRUNC((CMR-0.25)*16+0.5)/16,0)))","v":-0.1875},{"$f":"TRUNC((Frame_Width-(A283CDIM*2))*16+0.5)/16","v":0.375},{"$f":"IF(AND(W>0,H>0,BTYPE=\"Custom\",CMR=0),\"<< Enter CMR Location\",IF(AND(W>0,H>0,BTYPE=\"Custom\"),\"<< CMR, Ends to M.R\",\"\"))","v":""},null,null,null,null,{"$f":"IF(TYPE=4,J18,\"\")","v":""},4,{"$f":"Frame_Height-CMR","v":0},0,null,null,null,null,{"$f":"IF(TYPE=4,R18,\"\")","v":""},4,{"$f":"Frame_Height-CMR","v":0},0]
[null,"A392",{"$f":"IF(TYPE=1,TRUNC((Frame_Width/2)*16+0.5)/16,IF(TYPE=2,TRUNC((CMR-0.25)*32+0.5)/32,0))","v":0},{"$f":"Frame_Width-A392CDIM","v":0},{"$f":"IF(AND(W>0,H>0,BTYPE=\"Custom\",CMR=0),\"<< Enter CMR Location\",IF(AND(W>0,H>0,BTYPE=\"Custom\"),\"<< CMR, Left to Right\",\"\"))","v":""}]
[null,"A393",{"$f":"IF(TYPE=1,TRUNC(((Frame_Width/4)-0.25)*16+0.5)/16,IF(TYPE=2,TRUNC(((Frame_Width/3)-0.25)*16+0.5)/16,IF(TYPE=3,TRUNC((CMR-0.25)*16+0.5)/16,0)))","v":-0.1875},{"$f":"TRUNC((Frame_Width-(A393CDIM*2))*16+0.5)/16","v":0.375},{"$f":"IF(AND(W>0,H>0,BTYPE=\"Custom\",CMR=0),\"<< Enter CMR Location\",IF(AND(W>0,H>0,BTYPE=\"Custom\"),\"<< CMR, Ends to M.R\",\"\"))","v":""},null,null,null,"Dim.,\"D\"",null,"=",{"$f":"IF(J19=J18,M19,IF(J20=J18,M20,IF(J21=J18,M21,IF(J22=J18,M22,IF(J23=J18,M23,IF(J24=J18,M24,M19))))))","v":0},null,null,null,null,"Dim.,\"D\"",null,"=",{"$f":"IF(R19=R18,U19,IF(R20=R18,U20,IF(R21=R18,U21,IF(R22=R18,U22,IF(R23=R18,U23,IF(R24=R18,U24,U19))))))","v":0}]
[null,"A571",{"$f":"IF(TYPE=1,TRUNC((Frame_Height/2)*16+0.5)/16,IF(TYPE=2,TRUNC((CMR-0.25)*16+0.5)/16,0))","v":0},{"$f":"Frame_Height-A571CDIM","v":0},{"$f":"IF(AND(W>0,H>0,BTYPE=\"Custom\",CMR=0),\"<< Enter CMR Location\",IF(AND(W>0,H>0,BTYPE=\"Custom\"),\"<< CMR, Bottom-Up\",\"\"))","v":""},null,null,null,"Dim.,\"C\"",null,"=",{"$f":"Frame_Height-L26","v":0},null,null,null,null,"Dim.,\"C\"",null,"=",{"$f":"TRUNC((Frame_Height-T26)*32+0.5)/32","v":0}]
[null,"A581",{"$f":"IF(TYPE=1,TRUNC((Frame_Height/2)*16+0.5)/16,IF(TYPE=2,TRUNC((CMR-0.25)*16+0.5)/16,0))","v":0},{"$f":"Frame_Height-A581CDIM","v":0},{"$f":"IF(AND(W>0,H>0,BTYPE=\"Custom\",CMR=0),\"<< Enter CMR Location\",IF(AND(W>0,H>0,BTYPE=\"Custom\"),\"<< CMR, Bottom-Up\",\"\"))","v":""}]
[null,"A991",{"$f":"IF(TYPE=1,TRUNC((Frame_Height/2)*16+0.5)/16,IF(TYPE=2,TRUNC((CMR-0.25)*16+0.5)/16,0))","v":0},{"$f":"Frame_Height-A991CDIM","v":0},{"$f":"IF(AND(W>0,H>0,BTYPE=\"Custom\",CMR=0),\"<< Enter CMR Location\",IF(AND(W>0,H>0,BTYPE=\"Custom\"),\"<< CMR, Bottom-Up\",\"\"))","v":""},null,null,null,"Top Glass Width",null,null,{"$f":"TRUNC((Frame_Width-3.4375)*16+0.5)/16","v":-3.375},null,null,null,null,"Top Glass Width",null,null,{"$f":"TRUNC((Frame_Width-4.75)*16+0.5)/16","v":-4.6875}]
[null,"A202",{"$f":"IF(TYPE=1,TRUNC(((Frame_Width/2))*16+0.5)/16,IF(TYPE=2,CMR,0))","v":0},{"$f":"Frame_Width-A202CDIM","v":0},null,null,null,null,"Bottom Glass Width",null,null,{"$f":"TRUNC((Frame_Width-3.90625)*32+0.5)/32","v":-3.875},null,null,null,null,"Bottom Glass Width",null,null,{"$f":"TRUNC((Frame_Width-4.8125)*16+0.5)/16","v":-4.75}]
[null,"A203",{"$f":"IF(TYPE=1,TRUNC(((Frame_Width/4)+0.6875)*16+0.5)/16,IF(TYPE=2,CMR,0))","v":0.6875},{"$f":"TRUNC((Frame_Width-(A203CDIM*2))*16+0.5)/16","v":-1.3125},null,null,null,null,"Top Glass Height",null,null,{"$f":"TRUNC((L26-2.25)*16+0.5)/16","v":-2.1875},null,null,null,null,"Top Glass Height",null,null,{"$f":"TRUNC((T26-2.625)*32+0.5)/32","v":-2.59375}]
[null,"A209",{"$f":"TRUNC((Frame_Width/3+0.1875)*16+0.5)/16","v":0.1875},{"$f":"TRUNC((A209CDIM-0.5625)*16+0.5)/16","v":-0.3125},null,null,null,null,"Bottom Glass Height",null,null,{"$f":"TRUNC((L27-2.40625)*32+0.5)/32","v":-2.375},null,null,null,null,"Bottom Glass Height",null,null,{"$f":"TRUNC((T27-2.75)*32+0.5)/32","v":-2.71875}]
[null,"A172",{"$f":"IF(TYPE=1,TRUNC(((Frame_Width/2))*16+0.5)/16,IF(TYPE=2,CMR))","v":0},{"$f":"Frame_Width-A172CDIM","v":0}]
[null,"A173",{"$f":"IF(TYPE=1,TRUNC(((Frame_Width/3)+0.333)*16+0.5)/16,IF(TYPE=2,CMR+0.1875))","v":0.3125},{"$f":"TRUNC((((Frame_Width-A173CDIM)/2)-0.25)*16+0.5)/16","v":-0.375},null,null,null,null,null,"W",null,"0501",null,null,null,null,null,"W",null,"A740, A744, A746"]
[null,"A175",{"$f":"IF(TYPE=1,TRUNC(((Frame_Width/4)+0.3595)*16+0.5)/16,IF(TYPE=2,CMR-0.25))","v":0.375},{"$f":"TRUNC(((Frame_Width+0.5)/2-A175CDIM+0.469)*16+0.5)/16","v":0.375},null,null,null,null,null,{"$f":"IF(TYPE=1,J34,IF(TYPE= \"\",J34,\" \"))","v":"W"},1,{"$f":"Frame_Height/2","v":0},{"$f":"TRUNC(L35*16+0.5)/16","v":0},null,null,null,null,{"$f":"IF(TYPE=1,$R34,IF(TYPE= \"\",$R34,\" \"))","v":"W"},1,{"$f":"Frame_Height/2-CMRD","v":6},{"$f":"TRUNC(T35*16+0.5)/16","v":6}]
[null,"A192",{"$f":"IF(TYPE=1,TRUNC(((Frame_Width/2))*16+0.5)/16,IF(TYPE=2,CMR-0.25))","v":0},{"$f":"Frame_Width-A192CDIM","v":0},null,null,null,null,null,{"$f":"IF(TYPE=5,J34,IF(TYPE=2,IF(Frame_Height>=54.5,IF(Frame_Height<72.5,J34,\"\"),\"\"),\"\"))","v":""},2,{"$f":"CEILING(((Frame_Height/5-0.24)*3-0.03125),0.0625)","v":-0.75},-0.6875,5,null,null,null,null,2,{"$f":"INT((Frame_Height/5)*48+0.5)/16-CMRD","v":6},6,5]
[null,"A193",{"$f":"IF(TYPE=1,TRUNC(((Frame_Width/2))*16+0.5)/16,IF(TYPE=2,CMR-0.25))","v":0},{"$f":"Frame_Width-A193CDIM","v":0},null,null,null,null,null,{"$f":"IF(TYPE=6,J34,IF(AND(TYPE=2,OR(Frame_Height<54.5,Frame_Height>=72.5)),J34,\"\"))","v":""},null,{"$f":"TRUNC((Frame_Height/3-0.62)*32+0.5)/16","v":-1.1875},-1.125,6,null,null,null,null,null,{"$f":"INT((Frame_Height/3-0.22)*32+0.5)/16-CMRD","v":5.5625},5.5625,6]
[null,"A195",{"$f":"IF(TYPE=1,TRUNC(((Frame_Width/2))*16+0.5)/16,IF(TYPE=2,CMR-0.25))","v":0},{"$f":"Frame_Width-A195CDIM","v":0},null,null,null,null,null,{"$f":"IF(TYPE=7,J34,IF(TYPE=3,IF(Frame_Height>=54.5,IF(Frame_Height<72.5,J34,\"\"),\"\"),\"\"))","v":""},3,{"$f":"TRUNC((Frame_Height/5+0.38)*32+0.5)/16","v":0.75},0.75,7,null,null,null,null,3,{"$f":"INT((Frame_Height/5+0.55)*32+0.5)/16-CMRD","v":7.125},7.125,7]
[null,"A501",{"$f":"L75","v":0},{"$f":"L74","v":0},{"$f":"IF(AND(W>0,H>0,BTYPE=\"Custom\",CMR=0),\"<< Enter CMR Location\",IF(AND(W>0,H>0,BTYPE=\"Custom\"),\"<< CMR, Bottom-Up\",\"\"))","v":""},null,null,null,null,{"$f":"IF(TYPE=8,J34,IF(AND(TYPE=3,OR(Frame_Height<54.5,Frame_Height>=72.5)),J34,\"\"))","v":""},null,{"$f":"TRUNC((Frame_Height/3+1.3)*16+0.5)/16","v":1.3125},1.3125,8,null,null,null,null,null,{"$f":"INT((Frame_Height/3+1.4)*16+0.5)/16-CMRD","v":7.375},7.375,8]
[null,"02S0",{"$f":"L27","v":0},{"$f":"L26","v":0},null,null,null,null,null,{"$f":"IF(TYPE=4,J34,\"\")","v":""},4,{"$f":"CMR","v":0},0,null,null,null,null,{"$f":"IF(TYPE=2,$J34,\"\")","v":""},2,{"$f":"CMR-CMRD","v":6},6]
[null,"02S2",{"$f":"IF(TYPE=1,TRUNC(((Frame_Width/2))*16+0.5)/16,IF(TYPE=2,CMR,0))","v":0},{"$f":"Frame_Width-S2CDIM","v":0}]
[null,"02S3",{"$f":"IF(TYPE=1,TRUNC(((Frame_Width/4)+0.908)*32+0.5)/32,IF(TYPE=2,CMR,0))","v":0.90625},{"$f":"TRUNC((Frame_Width-(S3CDIM*2))*32+0.5)/32","v":-1.78125},null,null,null,null,"Dim.,\"D\"",null,"=",{"$f":"IF(J35=J34,M35,IF(J36=J34,M36,IF(J37=J34,M37,IF(J38=J34,M38,IF(J39=J34,M39,IF(J40=J34,M40,M35))))))","v":0},null,null,null,null,"Dim.,\"D\"",null,"=",{"$f":"IF(TYPE=1,Frame_Height/2,Frame_Height-CDIMA740)","v":0}]
[null,"02S9",{"$f":"TRUNC((Frame_Width/3+0.247)*32+0.5)/32","v":0.25},{"$f":"TRUNC((S9CDIM-0.741)*32+0.5)/32","v":-0.46875},null,null,null,null,"Dim.,\"C\"",null,"=",{"$f":"Frame_Height-L42","v":0},null,null,null,null,"Dim.,\"C\"",null,"=",{"$f":"IF(TYPE=2,CMR-0.25,Frame_Height-DDIMA740)","v":0}]
[null,"3A01",{"$f":"T11","v":0},{"$f":"T10","v":0},null,null,null,null,null,null,null,null,null,null,null,null,null,null,null,null,"Fraem R:",{"$f":"((Frame_Height-LEG)/2)+(((Frame_Width*2)^2)/(8*(Frame_Height-LEG)))","v":{"$error":"#DIV/0!"}},null,{"$f":"LEG-(Offset+((V44*COS((2*(ASIN((Frame_Width*2)/(2*V44))))/2))-(V45*COS((2*(ASIN(((Frame_Width*2)-(2*Offset))/(2*V45))))/2))))-1","v":{"$error":"#DIV/0!"}}]
[null,"03S0",{"$f":"T27","v":0},{"$f":"T26","v":0},null,null,null,null,"Top Glass Width",null,null,{"$f":"TRUNC((Frame_Width-6.125)*16+0.5)/16","v":-6.0625},null,null,null,null,"Top Glass Width",null,null,{"$f":"TRUNC((Frame_Width-2*EXT)*16+0.5)/16","v":0},"Glass R:",{"$f":"V44-EXT","v":{"$error":"#DIV/0!"}},"F",{"$f":"IF(Frame_Width>=(Frame_Height-LEG),2*(ASIN((EXT*2)/(2*V45))),2*(ASIN(((V45-(Frame_Width-2*EXT))*2)/(2*V45))))","v":{"$error":"#DIV/0!"}}]
[null,"7SH2",{"$f":"IF(TYPE=1,Frame_Height/2,IF(TYPE=2,CMR-0.25,0))","v":0},{"$f":"Frame_Height-CDIM7SH2","v":0},{"$f":"IF(AND(W>0,H>0,BTYPE=\"Custom\",CMR=0),\"<< Enter CMR Location\",IF(AND(W>0,H>0,BTYPE=\"Custom\"),\"<< CMR, Bottom-Up\",\"\"))","v":""},null,null,null,"Bottom Glass Width",null,null,{"$f":"TRUNC((Frame_Width-6.125)*16+0.5)/16","v":-6.0625},null,null,null,null,"Bottom Glass Width",null,null,{"$f":"Data!D156-2.1875","v":-4.3125}," Glass h:",{"$f":"IF(ModelNo=\"A746\",V45-(SQRT((4*V45^2)-(T45*2+(2*EXT))^2))/2,V45-(SQRT((4*V45^2)-(T45)^2)/2))","v":{"$error":"#DIV/0!"}},"d",{"$f":"V45*COS(X45/2)","v":{"$error":"#DIV/0!"}}]
[null,"7SH3",{"$f":"IF(TYPE=1,Frame_Height/2,IF(TYPE=2,CMR-0.25,0))","v":0},{"$f":"Frame_Height-CDIM7SH3","v":0},{"$f":"IF(AND(W>0,H>0,BTYPE=\"Custom\",CMR=0),\"<< Enter CMR Location\",IF(AND(W>0,H>0,BTYPE=\"Custom\"),\"<< CMR, Bottom-Up\",\"\"))","v":""},null,null,null,"Top Glass Height",null,null,{"$f":"TRUNC((L42-4.1875)*16+0.5)/16","v":-4.125},null,null,null,null,"Top Glass Height",null,null,{"$f":"IF(ModelNo=\"A746\",Frame_Height-($T$43+$V$47+EXT+X47),Frame_Height-($T$43+V47+EXT))","v":-0.6875},null,0.6875,"h",{"$f":"V45-X46","v":{"$error":"#DIV/0!"}}]
[null,"8SH2",{"$f":"IF(TYPE=1,Frame_Height/2,IF(TYPE=2,CMR-0.25,0))","v":0},{"$f":"Frame_Height-CDIM8SH2","v":0},{"$f":"IF(AND(W>0,H>0,BTYPE=\"Custom\",CMR=0),\"<< Enter CMR Location\",IF(AND(W>0,H>0,BTYPE=\"Custom\"),\"<< CMR, Bottom-Up\",\"\"))","v":""},null,null,null,"Bottom Glass Height",null,null,{"$f":"TRUNC((L43-4.1875)*16+0.5)/16","v":-4.125},null,null,null,null,"Bottom Glass Height",null,null,{"$f":"Data!D157-2.1875","v":-3.0625},"Top Glass Leg:",{"$f":"IF(ModelNo=\"A746\",T47-V46+X47,T47-V46)","v":{"$error":"#DIV/0!"}}]
[null,"8SH3",{"$f":"IF(TYPE=1,Frame_Height/2,IF(TYPE=2,CMR-0.25,0))","v":0},{"$f":"Frame_Height-CDIM8SH3","v":0},{"$f":"IF(AND(W>0,H>0,BTYPE=\"Custom\",CMR=0),\"<< Enter CMR Location\",IF(AND(W>0,H>0,BTYPE=\"Custom\"),\"<< CMR, Bottom-Up\",\"\"))","v":""}]
[null,"72HP",null,null,{"$f":"IF(AND(W>0,H>0,BTYPE=\"Custom\",CMR=0),\"<< Enter CMR Location\",IF(AND(W>0,H>0,BTYPE=\"Custom\"),\"<< CMR Bottom-Up\",\"\"))","v":""},null,null,null,null,"W",null,"0601",null,null,null,null,null,"W",null,"A840, A844, A846"]
[null,"72WP",null,null,{"$f":"IF(AND(W>0,H>0,BTYPE=\"Custom\",CMR=0),\"<< Enter CMR Location\",IF(AND(W>0,H>0,BTYPE=\"Custom\"),\"<< CMR, Left to Right\",\"\"))","v":""},null,null,null,null,{"$f":"IF(TYPE=1,J50,IF(TYPE= \"\",J50,\" \"))","v":"W"},1,{"$f":"Frame_Height/2","v":0},{"$f":"TRUNC(L51*16+0.5)/16","v":0},null,null,null,null,{"$f":"IF(TYPE=1,$R50,IF(TYPE= \"\",$R50,\" \"))","v":"W"},1,{"$f":"Frame_Height/2-CMRD","v":6},{"$f":"TRUNC(T51*16+0.5)/16","v":6}]
[null,"73HP",{"$f":"TRUNC((IF(TYPE=1,Frame_Height/3,IF(TYPE=2,CMR,0))*16+0.5))/16","v":0},null,{"$f":"IF(AND(W>0,H>0,BTYPE=\"Custom\",CMR=0),\"<< Enter CMR Location\",IF(AND(W>0,H>0,BTYPE=\"Custom\"),\"<< CMR, Ends to M.R\",\"\"))","v":""},null,null,null,null,{"$f":"IF(TYPE=5,J50,IF(TYPE=2,IF(Frame_Height>=54.5,IF(Frame_Height<72.5,J50,\"\"),\"\"),\"\"))","v":""},2,{"$f":"CEILING(((Frame_Height/5-0.24)*3-0.03125),0.0625)","v":-0.75},-0.6875,5,null,null,null,null,2,{"$f":"INT((Frame_Height/5)*48+0.5)/16-CMRD","v":6},6,5]
[null,"73WP",{"$f":"TRUNC((IF(TYPE=1,Frame_Width/3,IF(TYPE=2,CMR,0))*16+0.5))/16","v":0},null,{"$f":"IF(AND(W>0,H>0,BTYPE=\"Custom\",CMR=0),\"<< Enter CMR Location\",IF(AND(W>0,H>0,BTYPE=\"Custom\"),\"<< CMR, Ends to M.R\",\"\"))","v":""},null,null,null,null,{"$f":"IF(TYPE=6,J50,IF(AND(TYPE=2,OR(Frame_Height<54.5,Frame_Height>=72.5)),J50,\"\"))","v":""},null,{"$f":"TRUNC((Frame_Height/3-0.62)*32+0.5)/16","v":-1.1875},-1.125,6,null,null,null,null,null,{"$f":"INT((Frame_Height/3-0.22)*32+0.5)/16-CMRD","v":5.5625},5.5625,6]
[null,"82HP",null,null,{"$f":"IF(AND(W>0,H>0,BTYPE=\"Custom\",CMR=0),\"<< Enter CMR Location\",IF(AND(W>0,H>0,BTYPE=\"Custom\"),\"<< CMR Bottom-Up\",\"\"))","v":""},null,null,null,null,{"$f":"IF(TYPE=7,J50,IF(TYPE=3,IF(Frame_Height>=54.5,IF(Frame_Height<72.5,J50,\"\"),\"\"),\"\"))","v":""},3,{"$f":"TRUNC((Frame_Height/5+0.38)*32+0.5)/16","v":0.75},0.75,7,null,null,null,null,3,{"$f":"INT((Frame_Height/5+0.55)*32+0.5)/16-CMRD","v":7.125},7.125,7]
[null,"82WP",null,null,{"$f":"IF(AND(W>0,H>0,BTYPE=\"Custom\",CMR=0),\"<< Enter CMR Location\",IF(AND(W>0,H>0,BTYPE=\"Custom\"),\"<< CMR, Left to Right\",\"\"))","v":""},null,null,null,null,{"$f":"IF(TYPE=8,J50,IF(AND(TYPE=3,OR(Frame_Height<54.5,Frame_Height>=72.5)),J50,\"\"))","v":""},null,{"$f":"TRUNC((Frame_Height/3+1.3)*16+0.5)/16","v":1.3125},1.3125,8,null,null,null,null,null,{"$f":"INT((Frame_Height/3+1.4)*16+0.5)/16-CMRD","v":7.375},7.375,8]
[null,"83HP",{"$f":"TRUNC((IF(TYPE=1,Frame_Height/3,IF(TYPE=2,CMR,0))*16+0.5))/16","v":0},null,{"$f":"IF(AND(W>0,H>0,BTYPE=\"Custom\",CMR=0),\"<< Enter CMR Location\",IF(AND(W>0,H>0,BTYPE=\"Custom\"),\"<< CMR, Ends to M.R\",\"\"))","v":""},null,null,null,null,{"$f":"IF(TYPE=4,J50,\"\")","v":""},4,{"$f":"CMR","v":0},0,null,null,null,null,{"$f":"IF(TYPE=2,$J50,\"\")","v":""},4,{"$f":"CMR-CMRD","v":6},6]
[null,"83WP",{"$f":"TRUNC((IF(TYPE=1,Frame_Width/3,IF(TYPE=2,CMR,0))*16+0.5))/16","v":0},null,{"$f":"IF(AND(W>0,H>0,BTYPE=\"Custom\",CMR=0),\"<< Enter CMR Location\",IF(AND(W>0,H>0,BTYPE=\"Custom\"),\"<< CMR, Ends to M.R\",\"\"))","v":""}]
[null,"82SP",{"$f":"IF(TYPE=1,((Frame_Height/2)+0.25),IF(TYPE=2,CMR))","v":0.25},null,{"$f":"IF(AND(W>0,H>0,BTYPE=\"Custom\",CMR=0),\"<< Enter CMR Location\",IF(AND(W>0,H>0,BTYPE=\"Custom\"),\"<< CMR, Ends to M.R\",\"\"))","v":""},null,null,null,"Dim.,\"D\"",null,"=",{"$f":"IF(J51=J50,M51,IF(J52=J50,M52,IF(J53=J50,M53,IF(J54=J50,M54,IF(J55=J50,M55,IF(J56=J50,M56,M51))))))","v":0},null,null,null,null,"Dim.,\"D\"",null,"=",{"$f":"IF(TYPE=1,Frame_Height/2,Frame_Height-CDIMA840)","v":0}]
[null,"8SPS",{"$f":"IF(TYPE=1,((Frame_Height/2)+0.25),IF(TYPE=2,CMR))","v":0.25},null,null,null,null,null,"Dim.,\"C\"",null,"=",{"$f":"Frame_Height-L58","v":0},null,null,null,null,"Dim.,\"C\"",null,"=",{"$f":"IF(TYPE=2,CMR-0.25,Frame_Height-DDIMA840)","v":0}]
[null,"8SPP",{"$f":"IF(TYPE=1,(((Frame_Height-_DIM3+0.25)/2)-0.34375),IF(TYPE=2,CMR))","v":-0.21875},null,null,null,null,null,null,null,null,null,null,null,null,null,null,null,null,null,"Fraem R:",{"$f":"((Frame_Height-LEG)/2)+(((Frame_Width*2)^2)/(8*(Frame_Height-LEG)))","v":{"$error":"#DIV/0!"}},null,{"$f":"LEG-(Offset+((V60*COS((2*(ASIN((Frame_Width*2)/(2*V60))))/2))-(V61*COS((2*(ASIN(((Frame_Width*2)-(2*Offset))/(2*V61))))/2))))-1.375","v":{"$error":"#DIV/0!"}}]
[null,"8POS",{"$f":"IF(TYPE=1,(((_DIM3+0.25)/2)+0.34375),IF(TYPE=2,CMR))","v":0.46875},null,null,null,null,null,"Top Glass Width",null,null,{"$f":"TRUNC((Frame_Width-6.125)*16+0.5)/16","v":-6.0625},null,null,null,null,"Top Glass Width",null,null,{"$f":"TRUNC((Frame_Width-2*EXT)*16+0.5)/16","v":0},"Glass R:",{"$f":"V60-EXT","v":{"$error":"#DIV/0!"}},"F",{"$f":"IF(Frame_Width>=(Frame_Height-LEG),2*(ASIN((EXT*2)/(2*V61))),2*(ASIN(((V61-(Frame_Width-2*EXT))*2)/(2*V61))))","v":{"$error":"#DIV/0!"}}]
[null,"8SOP",{"$f":"IF(TYPE=1,(((Frame_Height-_DIM3+0.25)/2)-0.34375),IF(TYPE=2,CMR))","v":-0.21875},null,null,null,null,null,"Bottom Glass Width",null,null,{"$f":"TRUNC((Frame_Width-6.125)*16+0.5)/16","v":-6.0625},null,null,null,null,"Bottom Glass Width",null,null,{"$f":"Data!D174-2.5625","v":-5.375}," Glass h:",{"$f":"IF(ModelNo=\"A846\",V61-(SQRT((4*V61^2)-(T61*2+(2*EXT))^2))/2,V61-(SQRT((4*V61^2)-(T61)^2)/2))","v":{"$error":"#DIV/0!"}},"d",{"$f":"V61*COS(X61/2)","v":{"$error":"#DIV/0!"}}]
[null,"8PS3",{"$f":"IF(TYPE=1,(((_DIM3+0.25)/2)+0.34375),IF(TYPE=2,CMR))","v":0.46875},null,null,null,null,null,"Top Glass Height",null,null,{"$f":"TRUNC((L58-3.8125)*16+0.5)/16","v":-3.75},null,null,null,null,"Top Glass Height",null,null,{"$f":"IF(ModelNo=\"A846\",Frame_Height-($T$59+$V$63+EXT+X63),Frame_Height-($T$59+V63+EXT))","v":-0.71899999999999997},null,0.71899999999999997,"h",{"$f":"V61-X62","v":{"$error":"#DIV/0!"}}]
[null,"8SP3",{"$f":"IF(TYPE=1,(((Frame_Height-_DIM3+0.25)/2)-0.34375),IF(TYPE=2,CMR))","v":-0.21875},null,null,null,null,null,"Bottom Glass Height",null,null,{"$f":"TRUNC((L59-3.8125)*16+0.5)/16","v":-3.75},null,null,null,null,"Bottom Glass Height",null,null,{"$f":"Data!D175-2.5625","v":-4.0625},"Top Glass Leg:",{"$f":"IF(ModelNo=\"A846\",T63-V62+X63,T63-V62)","v":{"$error":"#DIV/0!"}}]
[]
[null,null,null,null,null,null,null,null,null,"W",null,"A501"]
[null,null,null,null,null,null,null,null,null,{"$f":"IF(TYPE=1,J66,IF(TYPE= \"\",J66,\" \"))","v":"W"},1,{"$f":"Frame_Height/2","v":0},{"$f":"TRUNC(L67*16+0.5)/16","v":0}]
[null,null,null,null,null,null,null,null,null,{"$f":"IF(TYPE=5,J66,IF(TYPE=2,IF(Frame_Height>=54.5,IF(Frame_Height<72.5,J66,\"\"),\"\"),\"\"))","v":""},2,{"$f":"CEILING(((Frame_Height/5-0.24)*3-0.03125),0.0625)","v":-0.75},-0.6875,5]
[null,null,null,null,null,null,null,null,null,{"$f":"IF(TYPE=6,J66,IF(AND(TYPE=2,OR(Frame_Height<54.5,Frame_Height>=72.5)),J66,\"\"))","v":""},null,{"$f":"TRUNC((Frame_Height/3-0.62)*32+0.5)/16","v":-1.1875},-1.125,6]
[null,null,null,null,null,null,null,null,null,{"$f":"IF(TYPE=7,J66,IF(TYPE=3,IF(Frame_Height>=54.5,IF(Frame_Height<72.5,J66,\"\"),\"\"),\"\"))","v":""},3,{"$f":"TRUNC((Frame_Height/5+0.38)*32+0.5)/16","v":0.75},0.75,7]
[null,null,null,null,null,null,null,null,null,{"$f":"IF(TYPE=8,J66,IF(AND(TYPE=3,OR(Frame_Height<54.5,Frame_Height>=72.5)),J66,\"\"))","v":""},null,{"$f":"TRUNC((Frame_Height/3+1.3)*16+0.5)/16","v":1.3125},1.3125,8]
[null,null,null,null,null,null,null,null,null,{"$f":"IF(TYPE=4,J66,\"\")","v":""},4,{"$f":"Frame_Height-CMR","v":0},0]
[]
[null,null,null,null,null,null,null,null,"Dim.,\"D\"",null,"=",{"$f":"IF(J67=J66,M67,IF(J68=J66,M68,IF(J69=J66,M69,IF(J70=J66,M70,IF(J71=J66,M71,IF(J72=J66,M72,M67))))))","v":0}]
[null,null,null,null,null,null,null,null,"Dim.,\"C\"",null,"=",{"$f":"Frame_Height-L74","v":0}]
[]
[null,null,null,null,null,null,null,null,"Top Glass Width",null,null,{"$f":"TRUNC((Frame_Width-6.71875)*32+0.5)/32","v":-6.6875}]
[null,null,null,null,null,null,null,null,"Bottom Glass Width",null,null,{"$f":"TRUNC((Frame_Width-6.71875)*32+0.5)/32","v":-6.6875}]
[null,null,null,null,null,null,null,null,"Top Glass Height",null,null,{"$f":"TRUNC((L74-3.5)*32+0.5)/32","v":-3.46875}]
[null,null,null,null,null,null,null,null,"Bottom Glass Height",null,null,{"$f":"TRUNC((L75-3.5)*32+0.5)/32","v":-3.46875}]
[]
[null,null,null,null,null,null,null,null,null,"W",null,"9001"]
[null,null,null,null,null,null,null,null,null,{"$f":"IF(TYPE=1,J82,IF(TYPE= \"\",J82,\" \"))","v":"W"},1,{"$f":"Frame_Height/2","v":0},{"$f":"TRUNC(L83*16+0.5)/16","v":0}]
[null,null,null,null,null,null,null,null,null,{"$f":"IF(TYPE=5,J82,IF(TYPE=2,IF(Frame_Height>=54.5,IF(Frame_Height<72.5,J82,\"\"),\"\"),\"\"))","v":""},2,{"$f":"CEILING(((Frame_Height/5-0.24)*3-0.03125),0.0625)","v":-0.75},-0.6875,5]
[null,null,null,null,null,null,null,null,null,{"$f":"IF(TYPE=6,J82,IF(AND(TYPE=2,OR(Frame_Height<54.5,Frame_Height>=72.5)),J82,\"\"))","v":""},null,{"$f":"TRUNC((Frame_Height/3-0.62)*32+0.5)/16","v":-1.1875},-1.125,6]
[null,null,null,null,null,null,null,null,null,{"$f":"IF(TYPE=7,J82,IF(TYPE=3,IF(Frame_Height>=54.5,IF(Frame_Height<72.5,J82,\"\"),\"\"),\"\"))","v":""},3,{"$f":"TRUNC((Frame_Height/5+0.38)*32+0.5)/16","v":0.75},0.75,7]
[null,null,null,null,null,null,null,null,null,{"$f":"IF(TYPE=8,J82,IF(AND(TYPE=3,OR(Frame_Height<54.5,Frame_Height>=72.5)),J82,\"\"))","v":""},null,{"$f":"TRUNC((Frame_Height/3+1.3)*16+0.5)/16","v":1.3125},1.3125,8]
[null,null,null,null,null,null,null,null,null,{"$f":"IF(TYPE=4,J82,\"\")","v":""},4,{"$f":"CMR","v":0},0]
[]
[null,null,null,null,null,null,null,null,"Dim.,\"D\"",null,"=",{"$f":"IF(J83=J82,M83,IF(J84=J82,M84,IF(J85=J82,M85,IF(J86=J82,M86,IF(J87=J82,M87,IF(J88=J82,M88,M83))))))","v":0}]
[null,null,null,null,null,null,null,null,"Dim.,\"C\"",null,"=",{"$f":"Frame_Height-L90","v":0}]
[]
[null,null,null,null,null,null,null,null,"Top Glass Width",null,null,{"$f":"TRUNC((Frame_Width-6.75)*16+0.5)/16","v":-6.6875}]
[null,null,null,null,null,null,null,null,"Bottom Glass Width",null,null,{"$f":"TRUNC((Frame_Width-6.75)*16+0.5)/16","v":-6.6875}]
[null,null,null,null,null,null,null,null,"Top Glass Height",null,null,{"$f":"TRUNC((L90-3.875)*16+0.5)/16","v":-3.8125}]
[null,null,null,null,null,null,null,null,"Bottom Glass Height",null,null,{"$f":"TRUNC((L91-3.875)*16+0.5)/16","v":-3.8125}]

{"sheet":"Data","index":3,"n_rows":1159,"n_cols":33,"rows_kept":1159,"cut":false,"hidden":true,"merged":[]}
[null,"Model","Description","Value"]
[{"$f":"IF(ModelNo=B2,1,\"\")","v":""},"A201","Top Sash Width",{"$f":"Frame_Width-3.25","v":-3.25},null,{"$f":"Model_Select","v":"Select Model"},"Models","Description","W cut-back","H-cut-back","Width","Height","Min W","Min H","Max W","Max H","Max UI","TYPE1","TYPE2","TYPE3","TYPE4","Dim3","Dim4","Screen1","Screen2","Screen3","Ext./Reinf.","Ext./Reinf.","Ext./Reinf.","Ext./Reinf.","Ext./Reinf.","Offset","Opening"]
[{"$f":"IF(ModelNo=B3,2,\"\")","v":""},"A201","Top Sash Height",{"$f":"CMR!$E$10-1.5625","v":-1.5625},null,1,"Select Model",0,0,0,0,0,0,0,0,0,0,0,0,0,0,null,null,0,0,0,0,0,0,0,0,0,0]
[{"$f":"IF(ModelNo=B4,3,\"\")","v":""},"A201","Bottom Sash Width",{"$f":"Frame_Width-2.25","v":-2.25},null,2,"3A01","Montrose Double Hung",null,null,null,null,12,20,{"$f":"IF(EXTSELECT=2,48,IF(EXTSELECT=3,52,\"\"))","v":""},{"$f":"IF(EXTSELECT=2,84,IF(EXTSELECT=3,96,\"\"))","v":""},{"$f":"IF(EXTSELECT=2,126,IF(EXTSELECT=3,148,\"\"))","v":""},"Standard","Oriel (2/3 - 1/3)","Cottage (1/3 - 2/3)","Custom",null,null,"Half","Full","Locking","Select Reinforcement","Composite","Steel",null,null,null,{"$f":"IF(RO=2,\"<< Exact Size Only\",\"\")","v":"<< Exact Size Only"}]
[{"$f":"IF(ModelNo=B5,4,\"\")","v":""},"A201","Bottom Sash Height",{"$f":"CMR!$E$11-0.5625","v":-0.5625},null,3,"3A02","Montrose Two Lite Slider",null,null,null,null,18.5,11.25,{"$f":"IF(EXTSELECT=2,72,IF(EXTSELECT=3,96,\"\"))","v":""},{"$f":"IF(EXTSELECT=2,56,IF(EXTSELECT=3,72,\"\"))","v":""},{"$f":"IF(EXTSELECT=2,128,IF(EXTSELECT=3,156,\"\"))","v":""},"Standard",null,null,null,null,null,"Half","Full",null,"Select Reinforcement","Composite","Steel",null,null,null,"<< Exact Size Only"]
[{"$f":"IF(ModelNo=B6,5,\"\")","v":""},"A201","Top Glass Width",{"$f":"CMR!$E$13","v":-4.875},null,4,"3A03","Montrose Three Lite Slider (1/4-1/2-1/4)",null,null,null,null,47.5,11.25,{"$f":"IF(EXTSELECT=2,108,IF(EXTSELECT=3,130,\"\"))","v":""},{"$f":"IF(EXTSELECT=2,56,IF(EXTSELECT=3,72,\"\"))","v":""},{"$f":"IF(EXTSELECT=2,164,IF(EXTSELECT=3,192,\"\"))","v":""},"Standard (1/4-1/2-1/4)",null,null,null,null,null,"Half","Full",null,"Select Reinforcement","Composite","Steel",null,null,null,"<< Exact Size Only"]
[{"$f":"IF(ModelNo=B7,6,\"\")","v":""},"A201","Top Glass Height",{"$f":"CMR!$E$15","v":-3.1875},null,5,"3A04","Montrose Picture Window",null,null,null,null,9.5,9.5,120,120,180,"Standard",null,null,null,null,null,null,null,null,null,null,null,null,null,null,"<< Exact Size Only"]
[{"$f":"IF(ModelNo=B8,7,\"\")","v":""},"A201","Bottom Glass Width",{"$f":"CMR!$E$14","v":-3.875},null,6,"3A09","Montrose Three Lite Slider Equal Lite",null,null,null,null,37.25,11.25,{"$f":"IF(EXTSELECT=2,108,IF(EXTSELECT=3,130,\"\"))","v":""},{"$f":"IF(EXTSELECT=2,56,IF(EXTSELECT=3,72,\"\"))","v":""},{"$f":"IF(EXTSELECT=2,164,IF(EXTSELECT=3,192,\"\"))","v":""},"Standard (1/3-1/3-1/3)",null,null,null,null,null,"Half","Full",null,"Select Reinforcement","Composite","Steel",null,null,null,"<< Exact Size Only"]
[{"$f":"IF(ModelNo=B9,8,\"\")","v":""},"A201","Bottom Glass Height",{"$f":"CMR!$E$16","v":-2.1875},null,7,"03S0","Montrose Single Hung",null,null,null,null,12,22,{"$f":"IF(EXTSELECT=2,48,IF(EXTSELECT=3,52,\"\"))","v":""},{"$f":"IF(EXTSELECT=2,78,IF(EXTSELECT=3,96,\"\"))","v":""},{"$f":"IF(EXTSELECT=2,126,IF(EXTSELECT=3,148,\"\"))","v":""},"Standard","Oriel (2/3 - 1/3)","Cottage (1/3 - 2/3)","Custom",null,null,"Half","Full","Locking","Select Reinforcement","Composite","Steel",null,null,null,"<< Exact Size Only"]
[{"$f":"IF(ModelNo=B10,9,\"\")","v":""},"A201","Screen Width",{"$f":"IF(Screen=\"L\",Frame_Width-1.6875,Frame_Width-3.6875)","v":-3.6875},null,8,"03S2","Montrose Two Lite Single Slider",null,null,null,null,18.5,12,{"$f":"IF(EXTSELECT=2,72,IF(EXTSELECT=3,96,\"\"))","v":""},{"$f":"IF(EXTSELECT=2,56,IF(EXTSELECT=3,72,\"\"))","v":""},{"$f":"IF(EXTSELECT=2,128,IF(EXTSELECT=3,156,\"\"))","v":""},"Standard",null,null,null,null,null,"Half","Full",null,"Select Reinforcement","Composite","Steel",null,null,null,"<< Exact Size Only"]
[{"$f":"IF(ModelNo=B11,10,\"\")","v":""},"A201","Screen Height",{"$f":"IF(Screen=\"L\",TRUNC((CMR!$E$11-1.375)*16+0.5)/16,IF(Screen=\"F\",TRUNC((Frame_Height-2.875)*16+0.5)/16,TRUNC((CMR!$E$11-0.3125)*16+0.5)/16))","v":-0.25},null,9,"03S3","Montrose Three Lite Slider (1/4-1/2-1/4)",null,null,null,null,52,12,{"$f":"IF(EXTSELECT=2,108,IF(EXTSELECT=3,130,\"\"))","v":""},{"$f":"IF(EXTSELECT=2,56,IF(EXTSELECT=3,72,\"\"))","v":""},{"$f":"IF(EXTSELECT=2,164,IF(EXTSELECT=3,182,\"\"))","v":""},"Standard (1/4-1/2-1/4)",null,null,null,null,null,"Half","Full",null,"Select Reinforcement","Composite","Steel",null,null,null,"<< Exact Size Only"]
[{"$f":"IF(ModelNo=B12,11,\"\")","v":""},"A201","Top Sash Weight (Plus 5 lb)",{"$f":"IF(ISERROR(TOP_WGT&\" \"&\"lb\"),\"N/A\",TOP_WGT&\" \"&\"lb\")","v":"N/A"},null,10,"03S4","Montrose Picture Window",null,null,null,null,9.5,9.5,120,120,180,"Standard",null,null,null,null,null,null,null,null,null,null,null,null,null,null,"<< Exact Size Only"]
[{"$f":"IF(ModelNo=B13,12,\"\")","v":""},"A201","Top Balance Size (C.F)",{"$f":"IF(ISERROR((VLOOKUP(TOP_WGT,CFB,2,FALSE))&(VLOOKUP(TOP_WGT,CFB,3,FALSE))),\"N/A\",(VLOOKUP(TOP_WGT,CFB,2,FALSE))&(VLOOKUP(TOP_WGT,CFB,3,FALSE)))","v":"N/A"},null,11,"03S9","Montrose Three Lite Slider Equal Lite",null,null,null,null,52,12,{"$f":"IF(EXTSELECT=2,108,IF(EXTSELECT=3,130,\"\"))","v":""},{"$f":"IF(EXTSELECT=2,56,IF(EXTSELECT=3,72,\"\"))","v":""},{"$f":"IF(EXTSELECT=2,164,IF(EXTSELECT=3,192,\"\"))","v":""},"Standard (1/3-1/3-1/3)",null,null,null,null,null,"Half","Full",null,"Select Reinforcement","Composite","Steel",null,null,null,"<< Exact Size Only"]
[{"$f":"IF(ModelNo=B14,13,\"\")","v":""},"A201","Bottom Sash Weight",{"$f":"IF(ISERROR(BTM_WGT&\" \"&\"lb\"),\"N/A\",BTM_WGT&\" \"&\"lb\")","v":"N/A"},null,12,"A140","Arched Top Single Hung (Round-Top)",null,null,null,null,{"$f":"IF(EXTSELECT=2,25,IF(EXTSELECT=3,26,IF(EXTSELECT=4,27,0)))","v":0},{"$f":"IF(EXTSELECT=2,40,IF(EXTSELECT=3,41,IF(EXTSELECT=4,42,0)))","v":0},52,96,148,"Standard","Custom",null,null,null,null,"Half",null,null,"Select Extrusion","Mezzo","Mezzo/N.F","Mezzo w/Stucco",null,2.40625,"<< Exact Size Only"]
[{"$f":"IF(ModelNo=B15,14,\"\")","v":""},"A201","Bottom Balance Size (C.F)",{"$f":"IF(ISERROR((VLOOKUP(BTM_WGT,CFB,2,FALSE))&(VLOOKUP(BTM_WGT,CFB,3,FALSE))),\"N/A\",(VLOOKUP(BTM_WGT,CFB,2,FALSE))&(VLOOKUP(BTM_WGT,CFB,3,FALSE)))","v":"N/A"},null,13,"A144","Arched Top Single Hung (Eyebrow)",null,null,null,null,16,43,52,96,148,"Standard","Custom",null,null,null,null,"Half",null,null,"Select Extrusion","Mezzo","Mezzo/N.F","Mezzo w/Stucco",null,2.40625,"<< Exact Size Only"]
[{"$f":"IF(ModelNo=B16,15,\"\")","v":""},"A201","Egress Opening Width",{"$f":"IF(ISERROR(EW),\"N/A\",EW)","v":"N/A"},null,14,"A146","Arched Top Single Hung (1/2 Eyebrow)",null,null,null,null,16,43,52,96,148,"Standard","Custom",null,null,null,null,"Half",null,null,"Select Extrusion","Mezzo","Mezzo/N.F","Mezzo w/Stucco",null,2.40625,"<< Exact Size Only"]
[{"$f":"IF(ModelNo=B17,16,\"\")","v":""},"A201","Egress Opening Height",{"$f":"IF(ISERROR(EH),\"N/A\",EH)","v":"N/A"},null,15,"A580","80 Series Picture Window",0.5,0.5,null,null,10.5,10.5,120,120,180,"Standard",null,null,null,null,null,null,null,null,null,null,null,null,null,null,"<< Select Opening"]
[{"$f":"IF(ModelNo=B18,17,\"\")","v":""},"A201","Egress Opening Area (sq.ft.)",{"$f":"IF(ISERROR(EO),\"N/A\",EO)","v":"N/A"},null,16,"A581","80 Series Single Hung",0.5,0.5,null,null,{"$f":"IF(AND(W>0,H>0,Frame_Height>=30),10.5,15)","v":15},{"$f":"IF(AND(W>0,H>0,Frame_Width>=15),24,30)","v":30},54,96,144,"Standard","Custom",null,null,null,null,"Half Only",null,null,null,null,null,null,null,null,"<< Select Opening"]
[{"$f":"IF(ModelNo=B19,1,\"\")","v":""},"A202","Inside Sash Width",{"$f":"A202CDIM-0.625","v":-0.625},null,17,"A280","80 Series Picture Window",0.5,0.5,null,null,10.5,10.5,120,120,180,"Standard",null,null,null,null,null,null,null,null,null,null,null,null,null,null,"<< Select Opening"]
[{"$f":"IF(ModelNo=B20,2,\"\")","v":""},"A202","Outside Sash Width",{"$f":"A202DDIM-0.625","v":-0.625},null,18,"A282","80 Series Single Slider",0.5,0.5,null,null,{"$f":"IF(AND(W>0,H>0,Frame_Height>=14.5),20,29.5)","v":29.5},{"$f":"IF(AND(W>0,H>0,Frame_Width>=29.5),10.5,14.5)","v":14.5},96,72,168,"Standard","Custom",null,null,null,null,"Half","Full",null,null,null,null,null,null,null,"<< Select Opening"]
[{"$f":"IF(ModelNo=B21,3,\"\")","v":""},"A202","Sash Height",{"$f":"Frame_Height-3.25","v":-3.25},null,19,"A283","80 Series Three Lite Slider",0.5,0.5,null,null,40,10.5,120,72,192,"1/4-1/2-1/4","1/3-1/3-1/3","Custom",null,null,null,"Half","Full",null,null,null,null,null,null,null,"<< Select Opening"]
[{"$f":"IF(ModelNo=B22,4,\"\")","v":""},"A202","Roller Track Length",{"$f":"Frame_Width-1.8125","v":-1.8125},null,20,"A780","80 Series. Picture Window",0.5,0.5,null,null,10,10,120,120,180,"Standard",null,null,null,null,null,null,null,null,null,null,null,null,null,null,"<< Select Opening"]
[{"$f":"IF(ModelNo=B23,5,\"\")","v":""},"A202","Inside Glass Width",{"$f":"(A202CDIM-0.625)-1.71875","v":-2.34375},null,21,"8SH2","80 Series Twin Single Hung",0.5,0.5,null,null,30,24,72,72,144,"Standard","Custom",null,null,null,null,"Half Only",null,null,null,null,null,null,null,null,"<< Select Opening"]
[{"$f":"IF(ModelNo=B24,6,\"\")","v":""},"A202","Outside Glass Width",{"$f":"(A202DDIM-0.625)-1.71875","v":-2.34375},null,22,"8SH3","80 Series Triple Single Hung",0.5,0.5,null,null,45,24,120,96,194,"Standard","Custom",null,null,null,null,"Half Only",null,null,null,null,null,null,null,null,"<< Select Opening"]
[{"$f":"IF(ModelNo=B25,7,\"\")","v":""},"A202","Glass Height",{"$f":"Frame_Height-4.9375","v":-4.9375},null,23,"A840","Arched Top Single Hung (Round-Top)",0.5,0.5,null,null,23.5,36.5,54,96,144,"Standard","Custom",null,null,null,null,"Half Only",null,null,"Select Extrusion","80 Series 1-3/8\" NFS","80 Series 1\" NFS","80 Series Flush Fin",null,1.28125,"<< Select Opening"]
[{"$f":"IF(ModelNo=B26,8,\"\")","v":""},"A202","Screen Width",{"$f":"IF(Screen=\"F\",Frame_Width-4.125,IF(Screen=\"L\",\"N/A\",(A202CDIM-0.625)-0.875))","v":-1.5},null,24,"A844","Arched Top Single Hung (Eyebrow)",0.5,0.5,null,null,15,30,54,96,144,"Standard","Custom",null,null,null,null,"Half Only",null,null,"Select Extrusion","80 Series 1-3/8\" NFS","80 Series 1\" NFS","Flush Fin",null,1.28125,"<< Select Opening"]
[{"$f":"IF(ModelNo=B27,9,\"\")","v":""},"A202","Screen Height",{"$f":"IF(Screen=\"H\",Frame_Height-3.6875,Frame_Height-3.75)","v":-3.6875},null,25,"A846","Arched Top Single Hung (1/2 Eyebrow)",0.5,0.5,null,null,15,30,54,96,144,"Standard","Custom",null,null,null,null,"Half Only",null,null,"Select Extrusion","80 Series 1-3/8\" NFS","80 Series 1\" NFS","Flush Fin",null,1.28125,"<< Select Opening"]
[{"$f":"IF(ModelNo=B28,10,\"\")","v":""},"A202","Egress Opening Width",{"$f":"IF(ISERROR(EW),\"N/A\",EW)","v":"N/A"},null,26,"82HP","80 Series Twin Stacked P.W",0.5,0.5,null,null,12,24,44,84,120,"Standard","Custom",null,null,null,null,null,null,null,"Select Extrusion","Slider Frame (280/580)","P.W Frame (A780)",null,null,{"$f":"IF(EXTSELECT=3,2,2.125)","v":2.125},"<< Select Opening"]
[{"$f":"IF(ModelNo=B29,11,\"\")","v":""},"A202","Egress Opening Height",{"$f":"IF(ISERROR(EH),\"N/A\",EH)","v":"N/A"},null,27,"82WP","80 Series Twin Side by Side P.W",0.5,0.5,null,null,24,12,84,44,120,"Standard","Custom",null,null,null,null,null,null,null,"Select Extrusion","Slider Frame (280/580)","P.W Frame (A780)",null,null,{"$f":"IF(EXTSELECT=3,2,2.125)","v":2.125},"<< Select Opening"]
[{"$f":"IF(ModelNo=B30,12,\"\")","v":""},"A202","Egress Opening Area (sq.ft.)",{"$f":"IF(ISERROR(EO),\"N/A\",EO)","v":"N/A"},null,28,"83HP","80 Series Triple Stacked P.W",0.5,0.5,null,null,12,36,84,108,168,"Standard","Custom",null,null,null,null,null,null,null,"Select Extrusion","Slider Frame (280/580)","P.W Frame (A780)",null,null,2.5625,"<< Select Opening"]
[{"$f":"IF(ModelNo=B31,1,\"\")","v":""},"A203","Operating Sash Width",{"$f":"A203CDIM-0.4375","v":0.25},null,29,"83WP","80 Series Triple Side by Side P.W",0.5,0.5,null,null,36,12,108,84,168,"Standard","Custom",null,null,null,null,null,null,null,"Select Extrusion","Slider Frame (280/580)","P.W Frame (A780)",null,null,2.5625,"<< Select Opening"]
[{"$f":"IF(ModelNo=B32,2,\"\")","v":""},"A203","Operating Sash Height",{"$f":"Frame_Height-3.25","v":-3.25},null,30,"82SP","80 Series SH next to PW",0.5,0.5,null,null,25.5,30,96,72,168,"Standard","Custom",null,null,null,1,"Half Only",null,null,"Operator Position","Operator Left","Operator Right",null,null,null,"<< Select Opening"]
[{"$f":"IF(ModelNo=B33,3,\"\")","v":""},"A203","Fixed Sash Width",{"$f":"A203DDIM+0.125","v":-1.1875},null,31,"8SPS","80 Series SH - PW - SH",0.5,0.5,null,null,40.5,30,96,72,168,"Standard","Custom",null,null,null,1,"Half Only",null,null,null,null,null,null,null,null,"<< Select Opening"]
[{"$f":"IF(ModelNo=B34,4,\"\")","v":""},"A203","Fixed Sash Height",{"$f":"Frame_Height-3.25","v":-3.25},null,32,"8SPP","80 Series SH over PW next to PW",0.5,0.5,null,null,25.5,40.5,72,96,168,"Standard","Custom",null,null,1,1,"Half Only",null,null,null,null,null,null,null,null,"<< Select Opening"]
[{"$f":"IF(ModelNo=B35,5,\"\")","v":""},"A203","Roller Track Length",{"$f":"Frame_Width-2.3125","v":-2.3125},null,33,"8POS","80 Series PW over SH",0.5,0.5,null,null,15,40.5,48,96,144,"Standard","Custom",null,null,1,null,"Half Only",null,null,null,null,null,null,null,null,"<< Select Opening"]
[{"$f":"IF(ModelNo=B36,6,\"\")","v":""},"A203","Operating Sash Glass Width",{"$f":"A203CDIM-2.125","v":-1.4375},null,34,"8SOP","80 Series SH over PW",0.5,0.5,null,null,15,40.5,48,96,144,"Standard","Custom",null,null,1,null,"Half Only",null,null,null,null,null,null,null,null,"<< Select Opening"]
[{"$f":"IF(ModelNo=B37,7,\"\")","v":""},"A203","Operating Sash Glass Height",{"$f":"Frame_Height-4.9375","v":-4.9375},null,35,"8PS3","80 Series Twin SH under Single PW",0.5,0.5,null,null,30,40.5,72,96,168,"Standard","Custom",null,null,1,1,"Half Only",null,null,null,null,null,null,null,null,"<< Select Opening"]
[{"$f":"IF(ModelNo=B38,8,\"\")","v":""},"A203","Fixed Sash Glass Width",{"$f":"A203DDIM-1.5625","v":-2.875},null,36,"8SP3","80 Series Twin SH over Single PW",0.5,0.5,null,null,30,40.5,72,96,168,"Standard","Custom",null,null,1,1,"Half Only",null,null,null,null,null,null,null,null,"<< Select Opening"]
[{"$f":"IF(ModelNo=B39,9,\"\")","v":""},"A203","Fixed Sash Glass Height",{"$f":"Frame_Height-4.9375","v":-4.9375},null,37,"A570","70 Series Picture Window",0.5,0.5,null,null,8.5,8.5,79,79,158,"Standard",null,null,null,null,null,null,null,null,null,null,null,null,null,null,"<< Select Opening"]
[{"$f":"IF(ModelNo=B40,10,\"\")","v":""},"A203","Screen Width",{"$f":"IF(Screen=\"F\",Frame_Width-4.125,IF(Screen=\"L\",\"N/A\",A203CDIM-1.1875))","v":-0.5},null,38,"A571","70 Series Single Hung",0.5,0.5,null,null,{"$f":"IF(AND(W>0,H>0,Frame_Height>=29.5),10,14.5)","v":14.5},{"$f":"IF(AND(W>0,H>0,Frame_Width>=14.5),23.5,29.5)","v":29.5},48,96,144,"Standard","Custom",null,null,null,null,"Half Only",null,null,null,null,null,null,null,null,"<< Select Opening"]
[{"$f":"IF(ModelNo=B41,11,\"\")","v":""},"A203","Screen Height",{"$f":"Frame_Height-3.6875","v":-3.6875},null,39,"A270","70 Series Picture Window",0.5,0.5,null,null,8.5,8.5,79,79,158,"Standard",null,null,null,null,null,null,null,null,null,null,null,null,null,null,"<< Select Opening"]
[{"$f":"IF(ModelNo=B42,12,\"\")","v":""},"A203","Egress Opening Width",{"$f":"IF(ISERROR(EW),\"N/A\",EW)","v":"N/A"},null,40,"A272","70 Series Single Slider",0.5,0.5,null,null,18,8.5,72,72,144,"Standard","Custom",null,null,null,null,"Half","Full",null,null,null,null,null,null,null,"<< Select Opening"]
[{"$f":"IF(ModelNo=B43,13,\"\")","v":""},"A203","Egress Opening Height",{"$f":"IF(ISERROR(EH),\"N/A\",EH)","v":"N/A"},null,41,"A273","70 Series Three Lite Slider",0.5,0.5,null,null,{"$f":"IF(AND(W>0,H>0,Frame_Height>=14.5),47.5,71.5)","v":71.5},{"$f":"IF(AND(W>0,H>0,Frame_Width>=71.5),9.5,14.5)","v":14.5},120,72,192,"1/4-1/2-1/4","1/3-1/3-1/3","Custom",null,null,null,"Half","Full",null,null,null,null,null,null,null,"<< Select Opening"]
[{"$f":"IF(ModelNo=B44,14,\"\")","v":""},"A203","Egress Opening Area (sq.ft.)",{"$f":"IF(ISERROR(EO),\"N/A\",EO)","v":"N/A"},null,42,"A770","70 Series Picture Window",0.5,0.5,null,null,8.5,8.5,120,120,180,"Standard",null,null,null,null,null,null,null,null,null,null,null,null,null,null,"<< Select Opening"]
[{"$f":"IF(OR(ModelNo=\"A204\",ModelNo=\"02S4\"),1,\"\")","v":""},"A204","Glass Width",{"$f":"Frame_Width-3.4375","v":-3.4375},null,43,"7SH2","70 Series Twin Single Hung",0.5,0.5,null,null,30,24,84,72,156,"Standard","Custom",null,null,null,null,"Half Only",null,null,null,null,null,null,null,null,"<< Select Opening"]
[{"$f":"IF(OR(ModelNo=\"A204\",ModelNo=\"02S4\"),2,\"\")","v":""},"A204","Glass Height",{"$f":"Frame_Height-3.4375","v":-3.4375},null,44,"7SH3","70 Series Triple Single Hung",0.5,0.5,null,null,45,24,108,84,168,"Standard","Custom",null,null,null,null,"Half Only",null,null,null,null,null,null,null,null,"<< Select Opening"]
[{"$f":"IF(OR(ModelNo=\"A204\",ModelNo=\"02S4\"),3,\"\")","v":""},"A204","Glass Area (sq.ft.)",{"$f":"(D45*D46)/144","v":8.2058376736111105E-2},null,45,"A740","Arched Top Single Hung (Round-Top)",0.5,0.5,null,null,23.5,37.5,48,96,144,"Standard","Custom",null,null,null,null,"Half Only",null,null,"Select Extrusion","70 Series 1-3/8\" NFS","70 Seires 7/8\" NFS","J-Channel","70 Series Flush Fin",1.15625,"<< Select Opening"]
[{"$f":"IF(ModelNo=B48,1,\"\")","v":""},"A209","Operating Sash Width",{"$f":"A209CDIM-0.4375","v":-0.25},null,46,"A744","Arched Top Single Hung (Eyebrow)",0.5,0.5,null,null,14.5,29.5,48,96,144,"Standard","Custom",null,null,null,null,"Half Only",null,null,"Select Extrusion","70 Series 1-3/8\" NFS","70 Seires 7/8\" NFS","J-Channel","70 Series Flush Fin",1.15625,"<< Select Opening"]
[{"$f":"IF(ModelNo=B49,2,\"\")","v":""},"A209","Operating Sash Height",{"$f":"Frame_Height-3.25","v":-3.25},null,47,"A746","Arched Top Single Hung (1/2 Eyebrow)",0.5,0.5,null,null,14.5,29.5,48,96,144,"Standard","Custom",null,null,null,null,"Half Only",null,null,"Select Extrusion","70 Series 1-3/8\" NFS","70 Seires 7/8\" NFS","J-Channel","70 Series Flush Fin",1.15625,"<< Select Opening"]
[{"$f":"IF(ModelNo=B50,3,\"\")","v":""},"A209","Fixed Sash Width",{"$f":"A209DDIM+0.125","v":-0.1875},null,48,"72HP","70 Series Twin Stacked P.W",0.5,0.5,null,null,12,24,72,{"$f":"IF(Frame_Width>44,72,84)","v":84},144,"Standard","Custom",null,null,null,null,null,null,null,"Select Extrusion","Slider Frame (270/570)","P.W Frame (A770)",null,null,{"$f":"IF(EXTSELECT=3,1.875,2)","v":2},"<< Select Opening"]
[{"$f":"IF(ModelNo=B51,4,\"\")","v":""},"A209","Fixed Sash Height",{"$f":"Frame_Height-3.25","v":-3.25},null,49,"72WP","70 Series Twin Side by Side P.W",0.5,0.5,null,null,24,12,{"$f":"IF(Frame_Height>44,72,84)","v":84},72,144,"Standard","Custom",null,null,null,null,null,null,null,"Select Extrusion","Slider Frame (270/570)","P.W Frame (A770)",null,null,{"$f":"IF(EXTSELECT=3,1.875,2)","v":2},"<< Select Opening"]
[{"$f":"IF(ModelNo=B52,5,\"\")","v":""},"A209","Roller Track Length",{"$f":"Frame_Width-2.3125","v":-2.3125},null,50,"73HP","70 Series Triple Stacked P.W",0.5,0.5,null,null,12,36,84,108,168,"Standard","Custom",null,null,null,null,null,null,null,"Select Extrusion","Slider Frame (270/570)","P.W Frame (A770)",null,null,2.3125,"<< Select Opening"]
[{"$f":"IF(ModelNo=B53,6,\"\")","v":""},"A209","Operating Sash Glass Width",{"$f":"A209CDIM-2.125","v":-1.9375},null,51,"73WP","70 Series Triple Side by Side P.W",0.5,0.5,null,null,36,12,108,84,168,"Standard","Custom",null,null,null,null,null,null,null,"Select Extrusion","Slider Frame (270/570)","P.W Frame (A770)",null,null,2.3125,"<< Select Opening"]
[{"$f":"IF(ModelNo=B54,7,\"\")","v":""},"A209","Operating Sash Glass Height",{"$f":"Frame_Height-4.9375","v":-4.9375},null,52,"A680","Casement Picture Window",0.5,0.5,null,null,11.5,11.5,120,120,180,"Standard",null,null,null,null,null,null,null,null,null,null,null,null,null,null,"<< Select Opening"]
[{"$f":"IF(ModelNo=B55,8,\"\")","v":""},"A209","Fixed Sash Glass Width",{"$f":"A209DDIM-1.5625","v":-1.875},null,53,"A681","Single Vent Awning",0.5,0.5,null,null,{"$f":"IF(AND(W>0,H>0,Frame_Height>=18),16,20)","v":20},{"$f":"IF(AND(W>0,H>0,Frame_Width>=20),11.5,18)","v":18},48,48,96,"Standard",null,null,null,null,null,"Full",null,null,null,null,null,null,null,null,"<< Select Opening"]
[{"$f":"IF(ModelNo=B56,9,\"\")","v":""},"A209","Fixed Sash Glass Height",{"$f":"Frame_Height-4.9375","v":-4.9375},null,54,"A682","Single Vent Casement",0.5,0.5,null,null,15.75,17.5,36,78,114,"Standard",null,null,null,null,null,"Full",null,null,null,null,null,null,null,null,"<< Select Opening"]
[{"$f":"IF(ModelNo=B57,10,\"\")","v":""},"A209","Screen Width",{"$f":"IF(Screen=\"F\",Frame_Width-4.125,IF(Screen=\"L\",\"N/A\",A209CDIM-1.1875))","v":-1},null,55,"6COP","Operating Casement over PW",0.5,0.5,null,null,15.75,29,42,96,138,"Standard",null,null,null,1,null,"Full",null,null,null,null,null,null,null,null,"<< Select Opening"]
[{"$f":"IF(ModelNo=B58,11,\"\")","v":""},"A209","Screen Height",{"$f":"Frame_Height-3.6875","v":-3.6875},null,56,"6POA","Picture Window over Awning",0.5,0.5,null,null,20,29.5,48,96,144,"Standard",null,null,null,1,null,"Full",null,null,null,null,null,null,null,null,"<< Select Opening"]
[{"$f":"IF(ModelNo=B59,12,\"\")","v":""},"A209","Egress Opening Width",{"$f":"IF(ISERROR(EW),\"N/A\",EW)","v":"N/A"},null,57,"62WC","Twin Operating Casement",0.5,0.5,null,null,31.5,17.5,72,72,144,"Standard",null,null,null,null,1,"Full",null,null,null,null,null,null,null,null,"<< Select Opening"]
[{"$f":"IF(ModelNo=B60,13,\"\")","v":""},"A209","Egress Opening Height",{"$f":"IF(ISERROR(EH),\"N/A\",EH)","v":"N/A"},null,58,"62CP","Twin Casement over Picture Window",0.5,0.5,null,null,31.5,29,72,93,168,"Standard",null,null,null,1,1,"Full",null,null,null,null,null,null,null,null,"<< Select Opening"]
[{"$f":"IF(ModelNo=B61,14,\"\")","v":""},"A209","Egress Opening Area (sq.ft.)",{"$f":"IF(ISERROR(EO),\"N/A\",EO)","v":"N/A"},null,59,"6P2C","Twin Casement under Picture Window",0.5,0.5,null,null,31.5,29,72,93,168,"Standard",null,null,null,1,1,"Full",null,null,null,null,null,null,null,null,"<< Select Opening"]
[{"$f":"IF(ModelNo=B62,1,\"\")","v":""},"A270","Glass Width",{"$f":"Frame_Width-2.3125","v":-2.3125},null,60,"68CP","Casement next to Picture Window",0.5,0.5,null,null,31.5,29,72,93,168,"Standard",null,null,null,null,1,"Full",null,null,"Operator Position","Operator Left","Operator Right",null,null,null,"<< Select Opening"]
[{"$f":"IF(ModelNo=B63,2,\"\")","v":""},"A270","Glass Height",{"$f":"Frame_Height-2.3125","v":-2.3125},null,61,"6CPX","Operating Casement Next to PW Over PW",0.5,0.5,null,null,27.5,29,72,96,168,"Standard",null,null,null,1,1,"Full",null,null,"Operator Position","Operator Left","Operator Right",null,null,null,"<< Select Opening"]
[{"$f":"IF(ModelNo=B64,3,\"\")","v":""},"A270","Glass Area (sq.ft.)",{"$f":"(D62*D63)/144","v":3.7136501736111112E-2},null,62,"6CPC","Casement / Picture Window / Casement",0.5,0.5,null,null,43,17.5,96,72,168,"Standard",null,null,null,null,1,"Full",null,null,null,null,null,null,null,null,"<< Select Opening"]
[{"$f":"IF(ModelNo=B65,4,\"\")","v":""},"A270",{"$f":"IF(MAX_SHORT=1,\"Max Short Glass Must be Less Than \"&MAX_SG,\"\")","v":{"$error":"#N/A"}},null,null,63,"6CSP","Casement / Picture Window / Casement Over PW",0.5,0.5,null,null,43,29,96,72,168,"Standard",null,null,null,1,1,"Full",null,null,null,null,null,null,null,null,"<< Select Opening"]
[{"$f":"IF(ModelNo=B66,1,\"\")","v":""},"A272","Sash Width",{"$f":"A272CDIM-0.875","v":-0.875},null,64,"62HP","Double Stacked Casement P.W",0.5,0.5,null,null,11.5,23,42,96,138,"Standard",null,null,null,1,null,null,null,null,null,null,null,null,null,null,"<< Select Opening"]
[{"$f":"IF(ModelNo=B67,2,\"\")","v":""},"A272","Sash Height",{"$f":"Frame_Height-2.125","v":-2.125},null,65,"62HX","Double Stacked Casement P.W",0.5,0.5,null,null,11.5,23,72,96,168,"Standard",null,null,null,1,null,null,null,null,null,null,null,null,null,null,"<< Select Opening"]
[{"$f":"IF(ModelNo=B68,3,\"\")","v":""},"A272","Sash Glass Width",{"$f":"D66-2.1875","v":-3.0625},null,66,"62WP","Twin Side by Side Casement P.W",0.5,0.5,null,null,23,11.5,96,60,156,"Standard",null,null,null,null,1,null,null,null,null,null,null,null,null,null,"<< Select Opening"]
[{"$f":"IF(ModelNo=B69,4,\"\")","v":""},"A272","Sash Glass Height",{"$f":"D67-2.1875","v":-4.3125},null,67,"63WP","Triple Side by Side Casement P.W",0.5,0.5,null,null,34.5,11.5,108,60,168,"Standard",null,null,null,null,1,null,null,null,null,null,null,null,null,null,"<< Select Opening"]
[{"$f":"IF(ModelNo=B70,5,\"\")","v":""},"A272","Fixed Glass Width",{"$f":"A272DDIM-1.8125","v":-1.8125},null,67,"63HP","Triple Stacked Casement P.W",0.5,0.5,null,null,11.5,34.5,60,96,156,"Standard",null,null,null,1,null,null,null,null,null,null,null,null,null,null,"<< Select Opening"]
[{"$f":"IF(ModelNo=B71,6,\"\")","v":""},"A272","Fixed Glass Height",{"$f":"Frame_Height-2.3125","v":-2.3125},null,68,"6502","6500 Series Custom 2 Lite Patio Door",0,0,null,null,48,72,96,96,192,"3\" Sash","5\" Sash","French",null,null,null,"Full",null,null,null,null,null,null,null,null,{"$f":"IF(RO=2,\"<< Exact Size Only\",\"\")","v":"<< Exact Size Only"}]
[{"$f":"IF(ModelNo=B72,7,\"\")","v":""},"A272","Astragal Length",{"$f":"Frame_Height-1.8125","v":-1.8125},null,69,"6503","6500 Series Custom 3 Lite Patio Door",0,0,null,null,84,72,144,96,240,"3\" Sash","5\" Sash","French",null,null,null,"Full",null,null,null,null,null,null,null,null,{"$f":"IF(RO=2,\"<< Exact Size Only\",\"\")","v":"<< Exact Size Only"}]
[{"$f":"IF(ModelNo=B73,8,\"\")","v":""},"A272","Roller Track Length",{"$f":"Frame_Width-1.6875","v":-1.6875},null,70,"6504","6500 Series Custom 4 Lite Patio Door",0,0,null,null,96,72,144,96,240,"3\" Sash","5\" Sash","French",null,null,null,"Full",null,null,null,null,null,null,null,null,{"$f":"IF(RO=2,\"<< Exact Size Only\",\"\")","v":"<< Exact Size Only"}]
[{"$f":"IF(ModelNo=B74,9,\"\")","v":""},"A272","Screen Width",{"$f":"A272CDIM-1.8125","v":-1.8125},null,71,"6505","6500 Series Five Foot 2 Lite Patio Door",1.375,0.5,60,80,58.625,79.5,58.625,95.5,156,"3\" Sash","5\" Sash","French",null,null,null,"Full",null,null,null,null,null,null,null,null,{"$f":"IF(RO=1,\"<< Rough Opening Only\",\"\")","v":""}]
[{"$f":"IF(ModelNo=B75,10,\"\")","v":""},"A272","Screen Height",{"$f":"Frame_Height-2.125","v":-2.125},null,72,"6506","6500 Series Six Foot 2 Lite Patio Door",1.375,0.5,72,80,70.625,79.5,70.625,95.5,168,"3\" Sash","5\" Sash","French",null,null,null,"Full",null,null,null,null,null,null,null,null,""]
[{"$f":"IF(ModelNo=B76,11,\"\")","v":""},"A272","Egress Opening Width",{"$f":"IF(ISERROR(EW),\"N/A\",EW)","v":"N/A"},null,73,"6508","6500 Series Eight Foot 2 Lite Patio Door",1.75,0.5,96,80,94.25,79.5,94.25,95.5,192,"3\" Sash","5\" Sash","French",null,null,null,"Full",null,null,null,null,null,null,null,null,""]
[{"$f":"IF(ModelNo=B77,12,\"\")","v":""},"A272","Egress Opening Height",{"$f":"IF(ISERROR(EH),\"N/A\",EH)","v":"N/A"},null,74,"6509","6500 Series Nine Foot 3 Lite Patio Door",2.5,0.5,108,80,105.5,79.5,105.5,95.5,204,"3\" Sash","5\" Sash","French",null,null,null,"Full",null,null,null,null,null,null,null,null,""]
[{"$f":"IF(ModelNo=B78,13,\"\")","v":""},"A272","Egress Opening Area (sq.ft.)",{"$f":"IF(ISERROR(EO),\"N/A\",EO)","v":"N/A"},null,75,"6512","6500 Series Twelve Foot 4 Lite Patio Door",4.5,0.5,144,80,139.5,79.5,139.5,95.5,240,"3\" Sash","5\" Sash","French",null,null,null,"Full",null,null,null,null,null,null,null,null,""]
[{"$f":"IF(ModelNo=B79,1,\"\")","v":""},"A273","Operating Sash Width",{"$f":"A273CDIM-0.875","v":-1.0625},null,76,"6522","6500 Series Twelve Foot 3 Lite Patio Door",3.125,0.5,144,80,140.875,79.5,140.875,95.5,240,"3\" Sash","5\" Sash","French",null,null,null,"Full",null,null,null,null,null,null,null,null,""]
[{"$f":"IF(ModelNo=B80,2,\"\")","v":""},"A273","Operating Sash Height",{"$f":"Frame_Height-2.125","v":-2.125},null,77,"A17A","170 Series Patio Door Sidelite",0.5,0.5,null,null,11.5,47.5,84,96,180,"Standard",null,null,null,null,null,null,null,null,null,null,null,null,null,null,"<< Select Opening"]
[{"$f":"IF(ModelNo=B81,3,\"\")","v":""},"A273","Astragal Length",{"$f":"Frame_Height-1.8125","v":-1.8125},null,78,"A171","170 Series Patio Door Transom",0.5,0.5,null,null,47.5,11.5,108,49,156,"Standard",null,null,null,null,null,null,null,null,null,null,null,null,null,null,"<< Select Opening"]
[{"$f":"IF(ModelNo=B82,4,\"\")","v":""},"A273","Roller Track Length",{"$f":"Frame_Width-1.6875","v":-1.6875},null,79,"A172","Two Lite Sliding Patio Door",0.5,0.5,null,null,47.5,47.5,96,96,192,"Standard","Custom",null,null,null,null,"Full","Premium",null,null,null,null,null,null,null,"<< Select Opening"]
[{"$f":"IF(ModelNo=B83,5,\"\")","v":""},"A273","Operating Sash Glass Width",{"$f":"D79-2.1875","v":-3.25},null,80,"A173","Three Lite Sliding Patio Door",0.5,0.5,null,null,71.5,47.5,108,96,204,"Standard","Custom",null,null,null,null,"Full","Premium",null,null,null,null,null,null,null,"<< Select Opening"]
[{"$f":"IF(ModelNo=B84,6,\"\")","v":""},"A273","Operating Sash Glass Height",{"$f":"D80-2.1875","v":-4.3125},null,81,"A175","Four Lite Sliding Patio Door",0.5,0.5,null,null,95.5,47.5,142,96,238,"Standard","Custom",null,null,null,null,"Full","Premium",null,null,null,null,null,null,null,"<< Select Opening"]
[{"$f":"IF(ModelNo=B85,7,\"\")","v":""},"A273","Fixed Glass Width",{"$f":"A273DDIM-1.4375","v":-1.0625},null,82,"02S0","Westbridge Elite Single Hung",0,0,null,null,11,20,52,84,132,"Standard","Oriel (2/3-1/3)","Cottage (1/3-2/3)","Custom",null,null,"Half","Full","Locking",null,null,null,null,null,null,{"$f":"IF(RO=2,\"<< Exact Size Only\",\"\")","v":"<< Exact Size Only"}]
[{"$f":"IF(ModelNo=B86,8,\"\")","v":""},"A273","Fixed Glass Height",{"$f":"Frame_Height-2.3125","v":-2.3125},null,83,"02S2","Westbridge Elite Single Slider",0,0,null,null,18,12,84,66,148,"Standard","Custom",null,null,null,null,"Half","Full",null,null,null,null,null,null,null,"<< Exact Size Only"]
[{"$f":"IF(ModelNo=B87,9,\"\")","v":""},"A273","Screen Width",{"$f":"A273CDIM-1.8125","v":-2},null,84,"02S3","Westbridge Elite Three Lite Slider (1/4-1/2-1/4)",0,0,null,null,46,12,130,66,182,"1/4-1/2-1/4","Custom",null,null,null,null,"Half","Full",null,null,null,null,null,null,null,"<< Exact Size Only"]
[{"$f":"IF(ModelNo=B88,10,\"\")","v":""},"A273","Screen Height",{"$f":"Frame_Height-2.125","v":-2.125},null,85,"02S4","Westbridge Elite Picture Window",0,0,null,null,9,9,120,96,180,"Standard",null,null,null,null,null,null,null,null,null,null,null,null,null,null,"<< Exact Size Only"]
[{"$f":"IF(ModelNo=B89,11,\"\")","v":""},"A273","Egress Opening Width",{"$f":"IF(ISERROR(EW),\"N/A\",EW)","v":"N/A"},null,86,"02S9","Westbridge Elite Three Lite Slider Equal Lite",0,0,null,null,37.25,12,120,66,182,"1/3-1/3-1/3",null,null,null,null,null,"Half","Full",null,null,null,null,null,null,null,"<< Exact Size Only"]
[{"$f":"IF(ModelNo=B90,12,\"\")","v":""},"A273","Egress Opening Height",{"$f":"IF(ISERROR(EH),\"N/A\",EH)","v":"N/A"},null,87,"A201","Westbridge Elite Double Hung",0,0,null,null,11,20,52,84,132,"Standard","Oriel (2/3-1/3)","Cottage (1/3-2/3)","Custom",null,null,"Half","Full","Locking",null,null,null,null,null,null,"<< Exact Size Only"]
[{"$f":"IF(ModelNo=B91,13,\"\")","v":""},"A273","Egress Opening Area (sq.ft.)",{"$f":"IF(ISERROR(EO),\"N/A\",EO)","v":"N/A"},null,88,"A202","Westbridge Elite Two Lite Slider",0,0,null,null,18,9,84,72,148,"Standard","Custom",null,null,null,null,"Half","Full",null,null,null,null,null,null,null,"<< Exact Size Only"]
[{"$f":"IF(ModelNo=B92,1,\"\")","v":""},"A280","Glass Width",{"$f":"Frame_Width-2.5625","v":-2.5625},null,89,"A203","Westbridge Elite 3 Lite Slider (1/4-1/2-1/4)",0,0,null,null,47.5,9,130,72,192,"1/4-1/2-1/4","Custom",null,null,null,null,"Half","Full",null,null,null,null,null,null,null,"<< Exact Size Only"]
[{"$f":"IF(ModelNo=B93,2,\"\")","v":""},"A280","Glass Height",{"$f":"Frame_Height-2.5625","v":-2.5625},null,90,"A204","Westbridge Elite Picture Window",0,0,null,null,9,9,120,96,180,"Standard",null,null,null,null,null,null,null,null,null,null,null,null,null,null,"<< Exact Size Only"]
[{"$f":"IF(ModelNo=B94,3,\"\")","v":""},"A280","Glass Area (sq.ft.)",{"$f":"(D92*D93)/144","v":4.5600043402777776E-2},null,91,"A209","Westbridge Elite 3 Lite Slider Equal Lite",0,0,null,null,37.25,9,130,72,192,"1/3-1/3-1/3",null,null,null,null,null,"Half","Full",null,null,null,null,null,null,null,"<< Exact Size Only"]
[{"$f":"IF(ModelNo=B95,4,\"\")","v":""},"A280",{"$f":"IF(MAX_SHORT=1,\"Max Short Glass Must be Less Than \"&MAX_SG,\"\")","v":{"$error":"#N/A"}},null,null,92,"A501","Westbridge Platinum Double Hung",0,0,null,null,15.25,26.75,52,84,136,"Standard","Oriel (2/3-1/3)","Cottage (1/3-2/3)","Custom",null,null,"Half","Full","Locking",null,null,null,null,null,null,"<< Exact Size Only"]
[{"$f":"IF(ModelNo=B96,1,\"\")","v":""},"A282","Sash Width",{"$f":"A282CDIM-1.5","v":-1.5},null,93,"A502","Westbridge Platinum Two Lite Slider",null,null,null,null,25.25,16.625,84,72,152,"Standard",null,null,null,null,null,"Half","Full",null,null,null,null,null,null,null,"<< Exact Size Only"]
[{"$f":"IF(ModelNo=B97,2,\"\")","v":""},"A282","Sash Height",{"$f":"Frame_Height-2.8125","v":-2.8125},null,94,"A503","Westbridge Platinum 3 Lite Slider (1/4-1/2-1/4)",null,null,null,null,44.5,16.625,120,68,184,"1/4-1/2-1/4",null,null,null,null,null,"Half","Full",null,null,null,null,null,null,null,"<< Exact Size Only"]
[{"$f":"IF(ModelNo=B98,3,\"\")","v":""},"A282","Sash Glass Width",{"$f":"D96-2.5625","v":-4.0625},null,95,"A504","Westbridge Platinum Picture Window",null,null,null,null,11,11,120,120,180,"Standard",null,null,null,null,null,null,null,null,null,null,null,null,null,null,"<< Exact Size Only"]
[{"$f":"IF(ModelNo=B99,4,\"\")","v":""},"A282","Sash Glass Height",{"$f":"D97-2.5625","v":-5.375},null,96,"A509","Westbridge Platinum 3 Lite Slider Equal Lite",null,null,null,null,35.5,16.625,120,72,184,"1/3-1/3-1/3",null,null,null,null,null,"Half","Full",null,null,null,null,null,null,null,"<< Exact Size Only"]
[{"$f":"IF(ModelNo=B100,5,\"\")","v":""},"A282","Fixed Glass Width",{"$f":"A282DDIM-2","v":-2},null,97,"A890","90 Series Picture Window",null,null,null,null,10,10,120,120,180,"Standard",null,null,null,null,null,null,null,null,null,null,null,null,null,null,"<< Exact Size Only"]
[{"$f":"IF(ModelNo=B101,6,\"\")","v":""},"A282","Fixed Glass Height",{"$f":"Frame_Height-2.5625","v":-2.5625},null,98,"A990","90 Series Picture Window",null,null,null,null,10.5,10.5,120,120,180,"Standard",null,null,null,null,null,null,null,null,null,null,null,null,null,null,"<< Exact Size Only"]
[{"$f":"IF(ModelNo=B102,7,\"\")","v":""},"A282","Astragal Length",{"$f":"Frame_Height-2.0625","v":-2.0625},null,99,"A991","90 Series Single Hung",null,null,null,null,{"$f":"IF(AND(W>0,H>0,Frame_Height>=30),10.5,15)","v":15},{"$f":"IF(AND(W>0,H>0,Frame_Width>=15),24,30)","v":30},54,96,144,"Standard","Custom",null,null,null,null,"Half","Full",null,null,null,null,null,null,null,"<< Exact Size Only"]
[{"$f":"IF(ModelNo=B103,8,\"\")","v":""},"A282","Roller Track Length",{"$f":"Frame_Width-2.125","v":-2.125},null,100,"A390","90 Series Picture Window",null,null,null,null,10.5,10.5,120,120,180,"Standard",null,null,null,null,null,null,null,null,null,null,null,null,null,null,"<< Exact Size Only"]
[{"$f":"IF(ModelNo=B104,9,\"\")","v":""},"A282","Screen Width",{"$f":"A282CDIM-2","v":-2},null,101,"A392","90 Series Single Slider",null,null,null,null,{"$f":"IF(AND(W>0,H>0,Frame_Height>=14.5),20,29.5)","v":29.5},{"$f":"IF(AND(W>0,H>0,Frame_Width>=29.5),10.5,14.5)","v":14.5},96,72,144,"Standard","Custom",null,null,null,null,"Half","Full",null,null,null,null,null,null,null,"<< Exact Size Only"]
[{"$f":"IF(ModelNo=B105,10,\"\")","v":""},"A282","Screen Height",{"$f":"Frame_Height-2.375","v":-2.375},null,102,"A393","90 Series Three Lite Slider",null,null,null,null,40,10.5,96,72,192,"1/4-1/2-1/4","1/3-1/3-1/3","Custom",null,null,null,"Half","Full",null,null,null,null,null,null,null,"<< Exact Size Only"]
[{"$f":"IF(ModelNo=B106,11,\"\")","v":""},"A282","Egress Opening Width",{"$f":"IF(ISERROR(EW),\"N/A\",EW)","v":"N/A"},null,103,"A690","Replacement Casement Picture Window",null,null,null,null,11.5,11.5,120,120,180,"Standard",null,null,null,null,null,null,null,null,null,null,null,null,null,null,"<< Select Opening"]
[{"$f":"IF(ModelNo=B107,12,\"\")","v":""},"A282","Egress Opening Height",{"$f":"IF(ISERROR(EH),\"N/A\",EH)","v":"N/A"},null,104,"A691","Replacement Single Vent Awning",null,null,null,null,{"$f":"IF(AND(W>0,H>0,Frame_Height>=18),16,20)","v":20},{"$f":"IF(AND(W>0,H>0,Frame_Width>=20),11.5,18)","v":18},48,48,96,"Standard",null,null,null,null,null,"Full",null,null,null,null,null,null,null,null,"<< Select Opening"]
[{"$f":"IF(ModelNo=B108,13,\"\")","v":""},"A282","Egress Opening Area (sq.ft.)",{"$f":"IF(ISERROR(EO),\"N/A\",EO)","v":"N/A"},null,105,"A692","Replacement Single Vent Casement",null,null,null,null,15.75,17.5,36,78,114,"Standard",null,null,null,null,null,"Full",null,null,null,null,null,null,null,null,"<< Select Opening"]
[{"$f":"IF(ModelNo=B109,1,\"\")","v":""},"A283","Operating Sash Width",{"$f":"A283CDIM-1.5","v":-1.6875},null,106,"A191","Single Lite Inswing Door",0.5,0.5,null,null,30.5,79.5,37,95.5,133,"Standard",null,null,null,null,null,"Full",null,null,null,null,null,null,null,null,"<< Select Opening"]
[{"$f":"IF(ModelNo=B110,2,\"\")","v":""},"A283","Operating Sash Height",{"$f":"Frame_Height-2.8125","v":-2.8125},null,107,"A192","Two Lite Inswing Door XO / OX",0.5,0.5,null,null,59.5,79.5,71.5,95.5,168,"Standard","Custom",null,null,null,null,"Full",null,null,null,null,null,null,null,null,"<< Select Opening"]
[{"$f":"IF(ModelNo=B111,3,\"\")","v":""},"A283","Astragal Length",{"$f":"Frame_Height-2.0625","v":-2.0625},null,108,"A193","Three Lite Inswing Door XX",0.5,0.5,null,null,59.5,79.5,71.5,95.5,168,"Standard","Custom",null,null,null,null,"Full",null,null,null,null,null,null,null,null,"<< Select Opening"]
[{"$f":"IF(ModelNo=B112,4,\"\")","v":""},"A283","Roller Track Length",{"$f":"Frame_Width-2.125","v":-2.125},null,109,"A194","190 Series Patio Door Transom",0.5,0.5,null,null,15,79.5,37,95.5,133,"Standard",null,null,null,null,null,"Full",null,null,null,null,null,null,null,null,"<< Select Opening"]
[{"$f":"IF(ModelNo=B113,5,\"\")","v":""},"A283","Operating Sash Glass Width",{"$f":"D109-2.5625","v":-4.25},null,110,"A195","190 Series Double Transom",0.5,0.5,null,null,59.5,79.5,71.5,95.5,168,"Standard",null,null,null,null,null,"Full",null,null,null,null,null,null,null,null,"<< Select Opening"]
[{"$f":"IF(ModelNo=B114,6,\"\")","v":""},"A283","Operating Sash Glass Height",{"$f":"D110-2.5625","v":-5.375},null,111,"B191","Single Lite Outswing Door",0.5,0.5,null,null,30.5,79.5,37,95.5,133,"Standard",null,null,null,null,null,"Full",null,null,null,null,null,null,null,null,"<< Select Opening"]
[{"$f":"IF(ModelNo=B115,7,\"\")","v":""},"A283","Fixed Glass Width",{"$f":"A283DDIM-1.5","v":-1.125},null,112,"B192","Two Lite Outswing Door XO / OX",0.5,0.5,null,null,59.5,79.5,71.5,95.5,168,"Standard","Custom",null,null,null,null,"Full",null,null,null,null,null,null,null,null,"<< Select Opening"]
[{"$f":"IF(ModelNo=B116,8,\"\")","v":""},"A283","Fixed Glass Height",{"$f":"Frame_Height-2.5625","v":-2.5625},null,113,"B193","Three Lite Outswing Door XX",0.5,0.5,null,null,59.5,79.5,71.5,95.5,168,"Standard","Custom",null,null,null,null,"Full",null,null,null,null,null,null,null,null,"<< Select Opening"]
[{"$f":"IF(ModelNo=B117,9,\"\")","v":""},"A283","Screen Width",{"$f":"A283CDIM-1.9375","v":-2.125},null,114,"B194","190 Series Patio Door Transom",0.5,0.5,null,null,15,79.5,37,95.5,133,"Standard",null,null,null,null,null,"Full",null,null,null,null,null,null,null,null,"<< Select Opening"]
[{"$f":"IF(ModelNo=B118,10,\"\")","v":""},"A283","Screen Height",{"$f":"Frame_Height-2.375","v":-2.375},null,115,"B195","190 Series Double Transom",0.5,0.5,null,null,59.5,79.5,71.5,95.5,168,"Standard",null,null,null,null,null,"Full",null,null,null,null,null,null,null,null,"<< Select Opening"]
[{"$f":"IF(ModelNo=B119,11,\"\")","v":""},"A283","Egress Opening Width",{"$f":"IF(ISERROR(EW),\"N/A\",EW)","v":"N/A"},null,{"$f":"VLOOKUP(Cell_Link,F3:G106,2,FALSE)","v":"Select Model"},{"$f":"Model_Select","v":"Select Model"},{"$f":"VLOOKUP(Model_Select,Data,2,FALSE)","v":0},{"$f":"VLOOKUP(Model_Select,Data,3,FALSE)","v":0},{"$f":"VLOOKUP(Model_Select,Data,4,FALSE)","v":0},{"$f":"VLOOKUP(Model_Select,Data,5,FALSE)","v":0},{"$f":"VLOOKUP(Model_Select,Data,6,FALSE)","v":0},{"$f":"VLOOKUP(Model_Select,Data,7,FALSE)","v":0},{"$f":"VLOOKUP(Model_Select,Data,8,FALSE)","v":0},{"$f":"VLOOKUP(Model_Select,Data,9,FALSE)","v":0},{"$f":"VLOOKUP(Model_Select,Data,10,FALSE)","v":0},{"$f":"VLOOKUP(Model_Select,Data,11,FALSE)","v":0},{"$f":"VLOOKUP(Model_Select,Data,12,FALSE)","v":0},{"$f":"VLOOKUP(Model_Select,Data,13,FALSE)","v":0},{"$f":"VLOOKUP(Model_Select,Data,14,FALSE)","v":0},{"$f":"VLOOKUP(Model_Select,Data,15,FALSE)","v":0},{"$f":"VLOOKUP(Model_Select,Data,16,FALSE)","v":0},{"$f":"VLOOKUP(Model_Select,Data,17,FALSE)","v":0},{"$f":"VLOOKUP(Model_Select,Data,18,FALSE)","v":0},{"$f":"VLOOKUP(Model_Select,Data,19,FALSE)","v":0},{"$f":"VLOOKUP(Model_Select,Data,20,FALSE)","v":0},{"$f":"VLOOKUP(Model_Select,Data,21,FALSE)","v":0},{"$f":"VLOOKUP(Model_Select,Data,22,FALSE)","v":0},{"$f":"VLOOKUP(Model_Select,Data,23,FALSE)","v":0},{"$f":"VLOOKUP(Model_Select,Data,24,FALSE)","v":0},{"$f":"VLOOKUP(Model_Select,Data,25,FALSE)","v":0},{"$f":"VLOOKUP(Model_Select,Data,26,FALSE)","v":0},{"$f":"VLOOKUP(Model_Select,Data,27,FALSE)","v":0}]
[{"$f":"IF(ModelNo=B120,12,\"\")","v":""},"A283","Egress Opening Height",{"$f":"IF(ISERROR(EH),\"N/A\",EH)","v":"N/A"},null,1,{"$f":"IF(OR(Model_Select=\"A140\",Model_Select=\"A144\",Model_Select=\"A146\",Model_Select=\"A740\",Model_Select=\"A744\",Model_Select=\"A746\",Model_Select=\"A840\",Model_Select=\"A844\",Model_Select=\"A846\"),1,0)","v":0}]
[{"$f":"IF(ModelNo=B121,13,\"\")","v":""},"A283","Egress Opening Area (sq.ft.)",{"$f":"IF(ISERROR(EO),\"N/A\",EO)","v":"N/A"},null,null,null,null,null,null,null,{"$f":"IF(OR(ModelNo=\"6505\",ModelNo=\"6506\",ModelNo=\"6508\",ModelNo=\"6509\",ModelNo=\"6512\",ModelNo=\"6522\"),1,0)","v":0}]
[{"$f":"IF(ModelNo=B122,1,\"\")","v":""},"A390","Glass Width",{"$f":"Frame_Width-2.5625","v":-2.5625},null,null,null,null,null,null,null,{"$f":"IF(HCONTROL=1,81,\"\")","v":""}]
[{"$f":"IF(ModelNo=B123,2,\"\")","v":""},"A390","Glass Height",{"$f":"Frame_Height-2.5625","v":-2.5625},null,null,null,null,null,null,null,{"$f":"IF(HCONTROL=1,82,\"\")","v":""}]
[{"$f":"IF(ModelNo=B124,3,\"\")","v":""},"A390","Glass Area (sq.ft.)",{"$f":"(D122*D123)/144","v":4.5600043402777776E-2},null,null,null,null,null,null,null,{"$f":"IF(HCONTROL=1,96,\"\")","v":""}]
[{"$f":"IF(ModelNo=B125,4,\"\")","v":""},"A390",{"$f":"IF(MAX_SHORT=1,\"Max Short Glass Must be Less Than \"&MAX_SG,\"\")","v":{"$error":"#N/A"}}]
[{"$f":"IF(ModelNo=B126,1,\"\")","v":""},"A392","Sash Width",{"$f":"A392CDIM-1.5","v":-1.5}]
[{"$f":"IF(ModelNo=B127,2,\"\")","v":""},"A392","Sash Height",{"$f":"Frame_Height-2.8125","v":-2.8125}]
[{"$f":"IF(ModelNo=B128,3,\"\")","v":""},"A392","Sash Glass Width",{"$f":"D126-2.5625","v":-4.0625}]
[{"$f":"IF(ModelNo=B129,4,\"\")","v":""},"A392","Sash Glass Height",{"$f":"D127-2.5625","v":-5.375}]
[{"$f":"IF(ModelNo=B130,5,\"\")","v":""},"A392","Fixed Glass Width",{"$f":"A392DDIM-2","v":-2}]
[{"$f":"IF(ModelNo=B131,6,\"\")","v":""},"A392","Fixed Glass Height",{"$f":"Frame_Height-2.5625","v":-2.5625}]
[{"$f":"IF(ModelNo=B132,7,\"\")","v":""},"A392","Astragal Length",{"$f":"Frame_Height-2.0625","v":-2.0625}]
[{"$f":"IF(ModelNo=B133,8,\"\")","v":""},"A392","Roller Track Length",{"$f":"Frame_Width-2.125","v":-2.125}]
[{"$f":"IF(ModelNo=B134,9,\"\")","v":""},"A392","Screen Width",{"$f":"A392CDIM-2","v":-2}]
[{"$f":"IF(ModelNo=B135,10,\"\")","v":""},"A392","Screen Height",{"$f":"Frame_Height-2.375","v":-2.375}]
[{"$f":"IF(ModelNo=B136,11,\"\")","v":""},"A392","Egress Opening Width",{"$f":"IF(ISERROR(EW),\"N/A\",EW)","v":"N/A"}]
[{"$f":"IF(ModelNo=B137,12,\"\")","v":""},"A392","Egress Opening Height",{"$f":"IF(ISERROR(EH),\"N/A\",EH)","v":"N/A"}]
[{"$f":"IF(ModelNo=B138,13,\"\")","v":""},"A392","Egress Opening Area (sq.ft.)",{"$f":"IF(ISERROR(EO),\"N/A\",EO)","v":"N/A"}]
[{"$f":"IF(ModelNo=B139,1,\"\")","v":""},"A393","Operating Sash Width",{"$f":"A393CDIM-1.5","v":-1.6875}]
[{"$f":"IF(ModelNo=B140,2,\"\")","v":""},"A393","Operating Sash Height",{"$f":"Frame_Height-2.8125","v":-2.8125}]
[{"$f":"IF(ModelNo=B141,3,\"\")","v":""},"A393","Astragal Length",{"$f":"Frame_Height-2.0625","v":-2.0625}]
[{"$f":"IF(ModelNo=B142,4,\"\")","v":""},"A393","Roller Track Length",{"$f":"Frame_Width-2.125","v":-2.125}]
[{"$f":"IF(ModelNo=B143,5,\"\")","v":""},"A393","Operating Sash Glass Width",{"$f":"D139-2.5625","v":-4.25}]
[{"$f":"IF(ModelNo=B144,6,\"\")","v":""},"A393","Operating Sash Glass Height",{"$f":"D140-2.5625","v":-5.375}]
[{"$f":"IF(ModelNo=B145,7,\"\")","v":""},"A393","Fixed Glass Width",{"$f":"A393DDIM-1.5","v":-1.125}]
[{"$f":"IF(ModelNo=B146,8,\"\")","v":""},"A393","Fixed Glass Height",{"$f":"Frame_Height-2.5625","v":-2.5625}]
[{"$f":"IF(ModelNo=B147,9,\"\")","v":""},"A393","Screen Width",{"$f":"A393CDIM-1.9375","v":-2.125}]
[{"$f":"IF(ModelNo=B148,10,\"\")","v":""},"A393","Screen Height",{"$f":"Frame_Height-2.375","v":-2.375}]
[{"$f":"IF(ModelNo=B149,11,\"\")","v":""},"A393","Egress Opening Width",{"$f":"IF(ISERROR(EW),\"N/A\",EW)","v":"N/A"}]
[{"$f":"IF(ModelNo=B150,12,\"\")","v":""},"A393","Egress Opening Height",{"$f":"IF(ISERROR(EH),\"N/A\",EH)","v":"N/A"}]
[{"$f":"IF(ModelNo=B151,13,\"\")","v":""},"A393","Egress Opening Area (sq.ft.)",{"$f":"IF(ISERROR(EO),\"N/A\",EO)","v":"N/A"}]
[{"$f":"IF(ModelNo=B152,1,\"\")","v":""},"A570","Glass Width",{"$f":"Frame_Width-2.3125","v":-2.3125}]
[{"$f":"IF(ModelNo=B153,2,\"\")","v":""},"A570","Glass Height",{"$f":"Frame_Height-2.3125","v":-2.3125}]
[{"$f":"IF(ModelNo=B154,3,\"\")","v":""},"A570","Glass Area (sq.ft.)",{"$f":"(D152*D153)/144","v":3.7136501736111112E-2}]
[{"$f":"IF(ModelNo=B155,4,\"\")","v":""},"A570",{"$f":"IF(MAX_SHORT=1,\"Max Short Glass Must be Less Than \"&MAX_SG,\"\")","v":{"$error":"#N/A"}}]
[{"$f":"IF(ModelNo=B156,1,\"\")","v":""},"A571","Bottom Sash Width",{"$f":"Frame_Width-2.125","v":-2.125}]
[{"$f":"IF(ModelNo=B157,2,\"\")","v":""},"A571","Bottom Sash Height",{"$f":"A571CDIM-0.875","v":-0.875}]
[{"$f":"IF(ModelNo=B158,3,\"\")","v":""},"A571","Bottom Glass Width",{"$f":"D156-2.1875","v":-4.3125}]
[{"$f":"IF(ModelNo=B159,4,\"\")","v":""},"A571","Bottom Glass Height",{"$f":"D157-2.1875","v":-3.0625}]
[{"$f":"IF(ModelNo=B160,5,\"\")","v":""},"A571","Top Glass Width",{"$f":"Frame_Width-2.3125","v":-2.3125}]
[{"$f":"IF(ModelNo=B161,6,\"\")","v":""},"A571","Top Glass Height",{"$f":"A571DDIM-1.8125","v":-1.8125}]
[{"$f":"IF(ModelNo=B162,7,\"\")","v":""},"A571","Astragal Length",{"$f":"Frame_Width-1.8125","v":-1.8125}]
[{"$f":"IF(ModelNo=B163,8,\"\")","v":""},"A571","Screen Width",{"$f":"Frame_Width-2.125","v":-2.125}]
[{"$f":"IF(ModelNo=B164,9,\"\")","v":""},"A571","Screen Height",{"$f":"A571CDIM-1.8125","v":-1.8125}]
[{"$f":"IF(ModelNo=B165,10,\"\")","v":""},"A571","Bottom Sash Weight",{"$f":"IF(ISERROR(BTM_WGT&\" \"&\"lb\"),\"N/A\",BTM_WGT&\" \"&\"lb\")","v":"N/A"}]
[{"$f":"IF(ModelNo=B166,11,\"\")","v":""},"A571","Balance Size (B&T)",{"$f":"IF(ISERROR(BTM_TUBE),\"N/A\",BTM_TUBE)","v":"N/A"}]
[{"$f":"IF(ModelNo=B167,12,\"\")","v":""},"A571","Egress Opening Width",{"$f":"IF(ISERROR(EW),\"N/A\",EW)","v":"N/A"}]
[{"$f":"IF(ModelNo=B168,13,\"\")","v":""},"A571","Egress Opening Height",{"$f":"IF(ISERROR(EH),\"N/A\",EH)","v":"N/A"}]
[{"$f":"IF(ModelNo=B169,14,\"\")","v":""},"A571","Egress Opening Area (sq.ft.)",{"$f":"IF(ISERROR(EO),\"N/A\",EO)","v":"N/A"}]
[{"$f":"IF(ModelNo=B170,1,\"\")","v":""},"A580","Glass Width",{"$f":"Frame_Width-2.5625","v":-2.5625}]
[{"$f":"IF(ModelNo=B171,2,\"\")","v":""},"A580","Glass Height",{"$f":"Frame_Height-2.5625","v":-2.5625}]
[{"$f":"IF(ModelNo=B172,3,\"\")","v":""},"A580","Glass Area (sq.ft.)",{"$f":"(D170*D171)/144","v":4.5600043402777776E-2}]
[{"$f":"IF(ModelNo=B173,4,\"\")","v":""},"A580",{"$f":"IF(MAX_SHORT=1,\"Max Short Glass Must be Less Than \"&MAX_SG,\"\")","v":{"$error":"#N/A"}}]
[{"$f":"IF(ModelNo=B174,1,\"\")","v":""},"A581","Bottom Sash Width",{"$f":"Frame_Width-2.8125","v":-2.8125}]
[{"$f":"IF(ModelNo=B175,2,\"\")","v":""},"A581","Bottom Sash Height",{"$f":"A581CDIM-1.5","v":-1.5}]
[{"$f":"IF(ModelNo=B176,3,\"\")","v":""},"A581","Bottom Glass Width",{"$f":"D174-2.5625","v":-5.375}]
[{"$f":"IF(ModelNo=B177,4,\"\")","v":""},"A581","Bottom Glass Height",{"$f":"D175-2.5625","v":-4.0625}]
[{"$f":"IF(ModelNo=B178,5,\"\")","v":""},"A581","Top Glass Width",{"$f":"Frame_Width-2.5625","v":-2.5625}]
[{"$f":"IF(ModelNo=B179,6,\"\")","v":""},"A581","Top Glass Height",{"$f":"A581DDIM-2","v":-2}]
[{"$f":"IF(ModelNo=B180,7,\"\")","v":""},"A581","Astragal Length",{"$f":"Frame_Width-2.0625","v":-2.0625}]
[{"$f":"IF(ModelNo=B181,8,\"\")","v":""},"A581","Screen Width",{"$f":"Frame_Width-2.375","v":-2.375}]
[{"$f":"IF(ModelNo=B182,9,\"\")","v":""},"A581","Screen Height",{"$f":"A581CDIM-2","v":-2}]
[{"$f":"IF(ModelNo=B183,10,\"\")","v":""},"A581","Bottom Sash Weight",{"$f":"IF(ISERROR(BTM_WGT&\" \"&\"lb\"),\"N/A\",BTM_WGT&\" \"&\"lb\")","v":"N/A"}]
[{"$f":"IF(ModelNo=B184,11,\"\")","v":""},"A581","Balance Size (B&T)",{"$f":"IF(ISERROR(BTM_TUBE),\"N/A\",BTM_TUBE)","v":"N/A"}]
[{"$f":"IF(ModelNo=B185,12,\"\")","v":""},"A581","Egress Opening Width",{"$f":"IF(ISERROR(EW),\"N/A\",EW)","v":"N/A"}]
[{"$f":"IF(ModelNo=B186,13,\"\")","v":""},"A581","Egress Opening Height",{"$f":"IF(ISERROR(EH),\"N/A\",EH)","v":"N/A"}]
[{"$f":"IF(ModelNo=B187,14,\"\")","v":""},"A581","Egress Opening Area (sq.ft.)",{"$f":"IF(ISERROR(EO),\"N/A\",EO)","v":"N/A"}]
[{"$f":"IF(ModelNo=B188,1,\"\")","v":""},"A680","Fixed Glass Width",{"$f":"Frame_Width-4.125","v":-4.125}]
[{"$f":"IF(ModelNo=B189,2,\"\")","v":""},"A680","Standard Bead Width (BC6410XX)",{"$f":"Frame_Width-1.3125","v":-1.3125}]
[{"$f":"IF(ModelNo=B190,3,\"\")","v":""},"A680","Fixed Glass Height",{"$f":"Frame_Height-4.125","v":-4.125}]
[{"$f":"IF(ModelNo=B191,4,\"\")","v":""},"A680","Standard Bead Height (BC6410XX)",{"$f":"Frame_Height-3.5","v":-3.5}]
[{"$f":"IF(ModelNo=B192,5,\"\")","v":""},"A680","Sash Width for Ventilator or Vent Wrap Option",{"$f":"Frame_Width-1.625","v":-1.625}]
[{"$f":"IF(ModelNo=B193,6,\"\")","v":""},"A680","Sash Height for Ventilator or Vent Wrap Option",{"$f":"Frame_Height-1.625","v":-1.625}]
[{"$f":"IF(ModelNo=B194,7,\"\")","v":""},"A680","Glass Width for Ventilator or Vent Wrap Option",{"$f":"D192-3.9375","v":-5.5625}]
[{"$f":"IF(ModelNo=B195,8,\"\")","v":""},"A680","V.W/Ventilator Bead Width (BC61774XX)",{"$f":"D192-3.625","v":-5.25}]
[{"$f":"IF(ModelNo=B196,9,\"\")","v":""},"A680","V.W Painted Bead Width (BC2105XX)",{"$f":"D192-1.84375","v":-3.46875}]
[{"$f":"IF(ModelNo=B197,10,\"\")","v":""},"A680","V.W Painted Bead TG2 Width (BC2106XX)",{"$f":"D192-1.84375","v":-3.46875}]
[{"$f":"IF(ModelNo=B198,11,\"\")","v":""},"A680","Glass Height for Ventilator or Vent Wrap Option",{"$f":"D193-5.8125","v":-7.4375}]
[{"$f":"IF(ModelNo=B199,12,\"\")","v":""},"A680","V.W/Ventilator Bead Height (BC61774XX)",{"$f":"D193-5.5","v":-7.125}]
[{"$f":"IF(ModelNo=B200,13,\"\")","v":""},"A680","V.W Painted Bead Height (BC2105XX)",{"$f":"D193-4.84375","v":-6.46875}]
[{"$f":"IF(ModelNo=B201,14,\"\")","v":""},"A680","V.W Painted Bead TG2 Height (BC2106XX)",{"$f":"D193-4.84375","v":-6.46875}]
[{"$f":"IF(ModelNo=B202,15,\"\")","v":""},"A680","Glass Height for Vent Wrap Only",{"$f":"D193-3.9375","v":-5.5625}]
[{"$f":"IF(ModelNo=B203,16,\"\")","v":""},"A680",{"$f":"IF(MAX_SHORT=1,\"Max Short Glass Must be Less Than \"&MAX_SG,\"\")","v":{"$error":"#N/A"}}]
[{"$f":"IF(ModelNo=B204,1,\"\")","v":""},"A681","Sash Width",{"$f":"Frame_Width-1.625","v":-1.625}]
[{"$f":"IF(ModelNo=B205,2,\"\")","v":""},"A681","Sash Height",{"$f":"Frame_Height-1.625","v":-1.625}]
[{"$f":"IF(ModelNo=B206,3,\"\")","v":""},"A681","Glass Width",{"$f":"D204-3.9375","v":-5.5625}]
[{"$f":"IF(ModelNo=B207,4,\"\")","v":""},"A681","Glass Height",{"$f":"D205-3.9375","v":-5.5625}]
[{"$f":"IF(ModelNo=B208,5,\"\")","v":""},"A681","Glass Height for Ventilator Option",{"$f":"D205-5.8125","v":-7.4375}]
[{"$f":"IF(ModelNo=B209,6,\"\")","v":""},"A681","Screen Width",{"$f":"Frame_Width-4.9375","v":-4.9375}]
[{"$f":"IF(ModelNo=B210,7,\"\")","v":""},"A681","Screen Height",{"$f":"Frame_Height-4.9375","v":-4.9375}]
[{"$f":"IF(ModelNo=B211,8,\"\")","v":""},"A681","Awning does not meet Egress"]
[{"$f":"IF(ModelNo=B212,1,\"\")","v":""},"A682","Sash Width",{"$f":"Frame_Width-1.625","v":-1.625}]
[{"$f":"IF(ModelNo=B213,2,\"\")","v":""},"A682","Sash Height",{"$f":"Frame_Height-1.625","v":-1.625}]
[{"$f":"IF(ModelNo=B214,3,\"\")","v":""},"A682","Glass Width",{"$f":"D212-3.9375","v":-5.5625}]
[{"$f":"IF(ModelNo=B215,4,\"\")","v":""},"A682","Glass Height",{"$f":"D213-3.9375","v":-5.5625}]
[{"$f":"IF(ModelNo=B216,5,\"\")","v":""},"A682","Glass Height for Ventilator Option",{"$f":"D213-5.8125","v":-7.4375}]
[{"$f":"IF(ModelNo=B217,6,\"\")","v":""},"A682","Screen Width",{"$f":"Frame_Width-4.9375","v":-4.9375}]
[{"$f":"IF(ModelNo=B218,7,\"\")","v":""},"A682","Screen Height",{"$f":"Frame_Height-4.9375","v":-4.9375}]
[{"$f":"IF(ModelNo=B219,8,\"\")","v":""},"A682","Egress Opening Width (Standard Hinge)",{"$f":"IF(ISERROR(EW),\"N/A\",EW)","v":"N/A"}]
[{"$f":"IF(ModelNo=B220,9,\"\")","v":""},"A682","Egress Opening Height (Standard Hinge)",{"$f":"IF(ISERROR(EH),\"N/A\",EH)","v":"N/A"}]
[{"$f":"IF(ModelNo=B221,10,\"\")","v":""},"A682","Egress Opening Area w/Standard Hinge (sq.ft.)",{"$f":"IF(ISERROR(EO),\"N/A\",EO)","v":"N/A"}]
[{"$f":"IF(ModelNo=B222,11,\"\")","v":""},"A682",{"$f":"IF(OR(Frame_Width<25.75,Frame_Width>31.75),\"Egress Hardware Not Available For This Width\",\"Egress Opening Width (Egress Hinge)\")","v":"Egress Hardware Not Available For This Width"},{"$f":"IF(OR(Frame_Width<25.75,Frame_Width>31.75),\"N/A\",Frame_Width-7.125)","v":"N/A"}]
[{"$f":"IF(ModelNo=B223,12,\"\")","v":""},"A682",{"$f":"IF(OR(Frame_Width<25.75,Frame_Width>31.75),\"Egress Hardware Not Available For This Width\",\"Egress Opening Height (Egress Hinge)\")","v":"Egress Hardware Not Available For This Width"},{"$f":"IF(OR(Frame_Width<25.75,Frame_Width>31.75),\"N/A\",Frame_Height-5.125)","v":"N/A"}]
[{"$f":"IF(ModelNo=B224,13,\"\")","v":""},"A682",{"$f":"IF(OR(Frame_Width<25.75,Frame_Width>31.75),\"Egress Hardware Not Available For This Width\",\"Egress Opening Area w/Egress Hinge (sq.ft.)\")","v":"Egress Hardware Not Available For This Width"},{"$f":"IF(OR(Frame_Width<25.75,Frame_Width>31.75),\"N/A\",(D222*D223)/144)","v":"N/A"}]
[{"$f":"IF(ModelNo=B225,1,\"\")","v":""},"A690","Fixed Glass Width",{"$f":"Frame_Width-4.125","v":-4.125}]
[{"$f":"IF(ModelNo=B226,2,\"\")","v":""},"A690","Standard Bead Width (BC6410XX)",{"$f":"Frame_Width-1.3125","v":-1.3125}]
[{"$f":"IF(ModelNo=B227,3,\"\")","v":""},"A690","Fixed Glass Height",{"$f":"Frame_Height-4.125","v":-4.125}]
[{"$f":"IF(ModelNo=B228,4,\"\")","v":""},"A690","Standard Bead Height (BC6410XX)",{"$f":"Frame_Height-3.5","v":-3.5}]
[{"$f":"IF(ModelNo=B229,5,\"\")","v":""},"A690","Sash Width for Ventilator or Vent Wrap Option",{"$f":"Frame_Width-1.625","v":-1.625}]
[{"$f":"IF(ModelNo=B230,6,\"\")","v":""},"A690","Sash Height for Ventilator or Vent Wrap Option",{"$f":"Frame_Height-1.625","v":-1.625}]
[{"$f":"IF(ModelNo=B231,7,\"\")","v":""},"A690","Glass Width for Ventilator or Vent Wrap Option",{"$f":"D229-3.9375","v":-5.5625}]
[{"$f":"IF(ModelNo=B232,8,\"\")","v":""},"A690","V.W/Ventilator Bead Width (BC61774XX)",{"$f":"D229-3.625","v":-5.25}]
[{"$f":"IF(ModelNo=B233,9,\"\")","v":""},"A690","V.W Painted Bead Width (BC2105XX)",{"$f":"D229-1.84375","v":-3.46875}]
[{"$f":"IF(ModelNo=B234,10,\"\")","v":""},"A690","V.W Painted Bead TG2 Width (BC2106XX)",{"$f":"D229-1.84375","v":-3.46875}]
[{"$f":"IF(ModelNo=B235,11,\"\")","v":""},"A690","Glass Height for Ventilator or Vent Wrap Option",{"$f":"D230-5.8125","v":-7.4375}]
[{"$f":"IF(ModelNo=B236,12,\"\")","v":""},"A690","V.W/Ventilator Bead Height (BC61774XX)",{"$f":"D230-5.5","v":-7.125}]
[{"$f":"IF(ModelNo=B237,13,\"\")","v":""},"A690","V.W Painted Bead Height (BC2105XX)",{"$f":"D230-4.84375","v":-6.46875}]
[{"$f":"IF(ModelNo=B238,14,\"\")","v":""},"A690","V.W Painted Bead TG2 Height (BC2106XX)",{"$f":"D230-4.84375","v":-6.46875}]
[{"$f":"IF(ModelNo=B239,15,\"\")","v":""},"A690","Glass Height for Vent Wrap Only",{"$f":"D230-3.9375","v":-5.5625}]
[{"$f":"IF(ModelNo=B240,16,\"\")","v":""},"A690",{"$f":"IF(MAX_SHORT=1,\"Max Short Glass Must be Less Than \"&MAX_SG,\"\")","v":{"$error":"#N/A"}}]
[{"$f":"IF(ModelNo=B241,1,\"\")","v":""},"A691","Sash Width",{"$f":"Frame_Width-1.625","v":-1.625}]
[{"$f":"IF(ModelNo=B242,2,\"\")","v":""},"A691","Sash Height",{"$f":"Frame_Height-1.625","v":-1.625}]
[{"$f":"IF(ModelNo=B243,3,\"\")","v":""},"A691","Glass Width",{"$f":"D241-3.9375","v":-5.5625}]
[{"$f":"IF(ModelNo=B244,4,\"\")","v":""},"A691","Glass Height",{"$f":"D242-3.9375","v":-5.5625}]
[{"$f":"IF(ModelNo=B245,5,\"\")","v":""},"A691","Glass Height for Ventilator Option",{"$f":"D242-5.8125","v":-7.4375}]
[{"$f":"IF(ModelNo=B246,6,\"\")","v":""},"A691","Screen Width",{"$f":"Frame_Width-4.9375","v":-4.9375}]
[{"$f":"IF(ModelNo=B247,7,\"\")","v":""},"A691","Screen Height",{"$f":"Frame_Height-4.9375","v":-4.9375}]
[{"$f":"IF(ModelNo=B248,8,\"\")","v":""},"A691","Awning does not meet Egress"]
[{"$f":"IF(ModelNo=B249,1,\"\")","v":""},"A692","Sash Width",{"$f":"Frame_Width-1.625","v":-1.625}]
[{"$f":"IF(ModelNo=B250,2,\"\")","v":""},"A692","Sash Height",{"$f":"Frame_Height-1.625","v":-1.625}]
[{"$f":"IF(ModelNo=B251,3,\"\")","v":""},"A692","Glass Width",{"$f":"D249-3.9375","v":-5.5625}]
[{"$f":"IF(ModelNo=B252,4,\"\")","v":""},"A692","Glass Height",{"$f":"D250-3.9375","v":-5.5625}]
[{"$f":"IF(ModelNo=B253,5,\"\")","v":""},"A692","Glass Height for Ventilator Option",{"$f":"D250-5.8125","v":-7.4375}]
[{"$f":"IF(ModelNo=B254,6,\"\")","v":""},"A692","Screen Width",{"$f":"Frame_Width-4.9375","v":-4.9375}]
[{"$f":"IF(ModelNo=B255,7,\"\")","v":""},"A692","Screen Height",{"$f":"Frame_Height-4.9375","v":-4.9375}]
[{"$f":"IF(ModelNo=B256,8,\"\")","v":""},"A692","Egress Opening Width (Standard Hinge)",{"$f":"IF(ISERROR(EW),\"N/A\",EW)","v":"N/A"}]
[{"$f":"IF(ModelNo=B257,9,\"\")","v":""},"A692","Egress Opening Height (Standard Hinge)",{"$f":"IF(ISERROR(EH),\"N/A\",EH)","v":"N/A"}]
[{"$f":"IF(ModelNo=B258,10,\"\")","v":""},"A692","Egress Opening Area w/Standard Hinge (sq.ft.)",{"$f":"IF(ISERROR(EO),\"N/A\",EO)","v":"N/A"}]
[{"$f":"IF(ModelNo=B259,11,\"\")","v":""},"A692",{"$f":"IF(OR(Frame_Width<25.75,Frame_Width>31.75),\"Egress Hardware Not Available For This Width\",\"Egress Opening Width (Egress Hinge)\")","v":"Egress Hardware Not Available For This Width"},{"$f":"IF(OR(Frame_Width<25.75,Frame_Width>31.75),\"N/A\",Frame_Width-7.125)","v":"N/A"}]
[{"$f":"IF(ModelNo=B260,12,\"\")","v":""},"A692",{"$f":"IF(OR(Frame_Width<25.75,Frame_Width>31.75),\"Egress Hardware Not Available For This Width\",\"Egress Opening Height (Egress Hinge)\")","v":"Egress Hardware Not Available For This Width"},{"$f":"IF(OR(Frame_Width<25.75,Frame_Width>31.75),\"N/A\",Frame_Height-5.125)","v":"N/A"}]
[{"$f":"IF(ModelNo=B261,13,\"\")","v":""},"A692",{"$f":"IF(OR(Frame_Width<25.75,Frame_Width>31.75),\"Egress Hardware Not Available For This Width\",\"Egress Opening Area w/Egress Hinge (sq.ft.)\")","v":"Egress Hardware Not Available For This Width"},{"$f":"IF(OR(Frame_Width<25.75,Frame_Width>31.75),\"N/A\",(D259*D260)/144)","v":"N/A"}]
[{"$f":"IF(ModelNo=B262,1,\"\")","v":""},"A770","Glass Width",{"$f":"Frame_Width-2.3125","v":-2.3125}]
[{"$f":"IF(ModelNo=B263,2,\"\")","v":""},"A770","Glass Height",{"$f":"Frame_Height-2.3125","v":-2.3125}]
[{"$f":"IF(ModelNo=B264,3,\"\")","v":""},"A770","Glass Area (sq.ft.)",{"$f":"(D262*D263)/144","v":3.7136501736111112E-2}]
[{"$f":"IF(ModelNo=B265,4,\"\")","v":""},"A770",{"$f":"IF(MAX_SHORT=1,\"Max Short Glass Must be Less Than \"&MAX_SG,\"\")","v":{"$error":"#N/A"}}]
[{"$f":"IF(ModelNo=B266,1,\"\")","v":""},"A780","Glass Width",{"$f":"Frame_Width-2.5625","v":-2.5625}]
[{"$f":"IF(ModelNo=B267,2,\"\")","v":""},"A780","Glass Height",{"$f":"Frame_Height-2.5625","v":-2.5625}]
[{"$f":"IF(ModelNo=B268,3,\"\")","v":""},"A780","Glass Area (sq.ft.)",{"$f":"(D266*D267)/144","v":4.5600043402777776E-2}]
[{"$f":"IF(ModelNo=B269,4,\"\")","v":""},"A780",{"$f":"IF(MAX_SHORT=1,\"Max Short Glass Must be Less Than \"&MAX_SG,\"\")","v":{"$error":"#N/A"}}]
[{"$f":"IF(ModelNo=B270,1,\"\")","v":""},"A990","Glass Width",{"$f":"Frame_Width-2.5625","v":-2.5625}]
[{"$f":"IF(ModelNo=B271,2,\"\")","v":""},"A990","Glass Height",{"$f":"Frame_Height-2.5625","v":-2.5625}]
[{"$f":"IF(ModelNo=B272,3,\"\")","v":""},"A990","Glass Area (sq.ft.)",{"$f":"(D270*D271)/144","v":4.5600043402777776E-2}]
[{"$f":"IF(ModelNo=B273,4,\"\")","v":""},"A990",{"$f":"IF(MAX_SHORT=1,\"Max Short Glass Must be Less Than \"&MAX_SG,\"\")","v":{"$error":"#N/A"}}]
[{"$f":"IF(ModelNo=B274,1,\"\")","v":""},"A991","Bottom Sash Width",{"$f":"Frame_Width-2.8125","v":-2.8125}]
[{"$f":"IF(ModelNo=B275,2,\"\")","v":""},"A991","Bottom Sash Height",{"$f":"A991CDIM-1.5","v":-1.5}]
[{"$f":"IF(ModelNo=B276,3,\"\")","v":""},"A991","Bottom Glass Width",{"$f":"D274-2.5625","v":-5.375}]
[{"$f":"IF(ModelNo=B277,4,\"\")","v":""},"A991","Bottom Glass Height",{"$f":"D275-2.5625","v":-4.0625}]
[{"$f":"IF(ModelNo=B278,5,\"\")","v":""},"A991","Top Glass Width",{"$f":"Frame_Width-2.5625","v":-2.5625}]
[{"$f":"IF(ModelNo=B279,6,\"\")","v":""},"A991","Top Glass Height",{"$f":"A991DDIM-2","v":-2}]
[{"$f":"IF(ModelNo=B280,7,\"\")","v":""},"A991","Astragal Length",{"$f":"Frame_Width-2.0625","v":-2.0625}]
[{"$f":"IF(ModelNo=B281,8,\"\")","v":""},"A991","Screen Width",{"$f":"Frame_Width-2.375","v":-2.375}]
[{"$f":"IF(ModelNo=B282,9,\"\")","v":""},"A991","Screen Height",{"$f":"A991CDIM-2","v":-2}]
[{"$f":"IF(ModelNo=B283,10,\"\")","v":""},"A991","Bottom Sash Weight",{"$f":"IF(ISERROR(BTM_WGT&\" \"&\"lb\"),\"N/A\",BTM_WGT&\" \"&\"lb\")","v":"N/A"}]
[{"$f":"IF(ModelNo=B284,11,\"\")","v":""},"A991","Balance Size (B&T)",{"$f":"IF(ISERROR(BTM_TUBE),\"N/A\",BTM_TUBE)","v":"N/A"}]
[{"$f":"IF(ModelNo=B285,12,\"\")","v":""},"A991","Egress Opening Width",{"$f":"IF(ISERROR(EW),\"N/A\",EW)","v":"N/A"}]
[{"$f":"IF(ModelNo=B286,13,\"\")","v":""},"A991","Egress Opening Height",{"$f":"IF(ISERROR(EH),\"N/A\",EH)","v":"N/A"}]
[{"$f":"IF(ModelNo=B287,14,\"\")","v":""},"A991","Egress Opening Area (sq.ft.)",{"$f":"IF(ISERROR(EO),\"N/A\",EO)","v":"N/A"}]
[{"$f":"IF(ModelNo=B288,1,\"\")","v":""},"A17A","Glass Width",{"$f":"Frame_Width-2","v":-2}]
[{"$f":"IF(ModelNo=B289,2,\"\")","v":""},"A17A","Glass Height",{"$f":"Frame_Height-5.75","v":-5.75}]
[{"$f":"IF(ModelNo=B290,3,\"\")","v":""},"A17A","Glass Area (sq.ft.)",{"$f":"(D288*D289)/144","v":7.9861111111111105E-2}]
[{"$f":"IF(ModelNo=B291,4,\"\")","v":""},"A17A",{"$f":"IF(MAX_SHORT=1,\"Max Short Glass Must be Less Than \"&MAX_SG,\"\")","v":{"$error":"#N/A"}}]
[{"$f":"IF(ModelNo=B292,1,\"\")","v":""},"A171","Glass Width",{"$f":"Frame_Width-2","v":-2}]
[{"$f":"IF(ModelNo=B293,2,\"\")","v":""},"A171","Glass Height",{"$f":"Frame_Height-2","v":-2}]
[{"$f":"IF(ModelNo=B294,3,\"\")","v":""},"A171","Glass Area (sq.ft.)",{"$f":"(D292*D293)/144","v":2.7777777777777776E-2}]
[{"$f":"IF(ModelNo=B295,1,\"\")","v":""},"A172","Sash Width",{"$f":"A172CDIM+1.0625","v":1.0625}]
[{"$f":"IF(ModelNo=B296,2,\"\")","v":""},"A172","Sash Height",{"$f":"Frame_Height-2.25","v":-2.25}]
[{"$f":"IF(ModelNo=B297,3,\"\")","v":""},"A172","Sash Glass Width",{"$f":"D295-3.5625","v":-2.5}]
[{"$f":"IF(ModelNo=B298,4,\"\")","v":""},"A172","Sash Glass Height",{"$f":"D296-3.5","v":-5.75}]
[{"$f":"IF(ModelNo=B299,5,\"\")","v":""},"A172","Fixed Glass Width",{"$f":"A172DDIM-2.5","v":-2.5}]
[{"$f":"IF(ModelNo=B300,6,\"\")","v":""},"A172","Fixed Glass Height",{"$f":"Frame_Height-5.75","v":-5.75}]
[{"$f":"IF(ModelNo=B301,7,\"\")","v":""},"A172","Panel Track",{"$f":"Frame_Width-1.5","v":-1.5}]
[{"$f":"IF(ModelNo=B302,8,\"\")","v":""},"A172","Screen Track",{"$f":"Frame_Width-1.5","v":-1.5}]
[{"$f":"IF(ModelNo=B303,9,\"\")","v":""},"A172","Screen Width",{"$f":"A172CDIM+0.25","v":0.25}]
[{"$f":"IF(ModelNo=B304,10,\"\")","v":""},"A172","Screen Height",{"$f":"IF(Screen_Type=2,Frame_Height-1.5,Frame_Height-1.75)","v":-1.75}]
[{"$f":"IF(ModelNo=B305,11,\"\")","v":""},"A172","Egress Opening Width",{"$f":"IF(ISERROR(EW),\"N/A\",EW)","v":"N/A"}]
[{"$f":"IF(ModelNo=B306,12,\"\")","v":""},"A172","Egress Opening Height",{"$f":"IF(ISERROR(EH),\"N/A\",EH)","v":"N/A"}]
[{"$f":"IF(ModelNo=B307,13,\"\")","v":""},"A172","Egress Opening Area (sq.ft.)",{"$f":"IF(ISERROR(EO),\"N/A\",EO)","v":"N/A"}]
[{"$f":"IF(ModelNo=B308,1,\"\")","v":""},"A173","Sash Width",{"$f":"A173CDIM+1.0625","v":1.375}]
[{"$f":"IF(ModelNo=B309,2,\"\")","v":""},"A173","Sash Height",{"$f":"Frame_Height-2.25","v":-2.25}]
[{"$f":"IF(ModelNo=B310,3,\"\")","v":""},"A173","Sash Glass Width",{"$f":"D308-3.5625","v":-2.1875}]
[{"$f":"IF(ModelNo=B311,4,\"\")","v":""},"A173","Sash Glass Height",{"$f":"D309-3.5","v":-5.75}]
[{"$f":"IF(ModelNo=B312,5,\"\")","v":""},"A173","Fixed Glass Width",{"$f":"A173DDIM-1.75","v":-2.125}]
[{"$f":"IF(ModelNo=B313,6,\"\")","v":""},"A173","Fixed Glass Height",{"$f":"Frame_Height-5.75","v":-5.75}]
[{"$f":"IF(ModelNo=B314,7,\"\")","v":""},"A173","Panel Track",{"$f":"Frame_Width-1.5","v":-1.5}]
[{"$f":"IF(ModelNo=B315,8,\"\")","v":""},"A173","Screen Track",{"$f":"Frame_Width-1.5","v":-1.5}]
[{"$f":"IF(ModelNo=B316,9,\"\")","v":""},"A173","Screen Width",{"$f":"A173CDIM+0.25","v":0.5625}]
[{"$f":"IF(ModelNo=B317,10,\"\")","v":""},"A173","Screen Height",{"$f":"IF(Screen_Type=2,Frame_Height-1.5,Frame_Height-1.75)","v":-1.75}]
[{"$f":"IF(ModelNo=B318,11,\"\")","v":""},"A173","Egress Opening Width",{"$f":"IF(ISERROR(EW),\"N/A\",EW)","v":"N/A"}]
[{"$f":"IF(ModelNo=B319,12,\"\")","v":""},"A173","Egress Opening Height",{"$f":"IF(ISERROR(EH),\"N/A\",EH)","v":"N/A"}]
[{"$f":"IF(ModelNo=B320,13,\"\")","v":""},"A173","Egress Opening Area (sq.ft.)",{"$f":"IF(ISERROR(EO),\"N/A\",EO)","v":"N/A"}]
[{"$f":"IF(ModelNo=B321,1,\"\")","v":""},"A175","Sash Width",{"$f":"A175CDIM+1.0625","v":1.4375}]
[{"$f":"IF(ModelNo=B322,2,\"\")","v":""},"A175","Sash Height",{"$f":"Frame_Height-2.25","v":-2.25}]
[{"$f":"IF(ModelNo=B323,3,\"\")","v":""},"A175","Sash Glass Width",{"$f":"D321-3.5625","v":-2.125}]
[{"$f":"IF(ModelNo=B324,4,\"\")","v":""},"A175","Sash Glass Height",{"$f":"D322-3.5","v":-5.75}]
[{"$f":"IF(ModelNo=B325,5,\"\")","v":""},"A175","Fixed Glass Width",{"$f":"A175DDIM-2.5","v":-2.125}]
[{"$f":"IF(ModelNo=B326,6,\"\")","v":""},"A175","Fixed Glass Height",{"$f":"Frame_Height-5.75","v":-5.75}]
[{"$f":"IF(ModelNo=B327,7,\"\")","v":""},"A175","Panel Track",{"$f":"Frame_Width-1.5","v":-1.5}]
[{"$f":"IF(ModelNo=B328,8,\"\")","v":""},"A175","Screen Track",{"$f":"Frame_Width-1.5","v":-1.5}]
[{"$f":"IF(ModelNo=B329,9,\"\")","v":""},"A175","Screen Width",{"$f":"A175CDIM+0.25","v":0.625}]
[{"$f":"IF(ModelNo=B330,10,\"\")","v":""},"A175","Screen Height",{"$f":"IF(Screen_Type=2,Frame_Height-1.5,Frame_Height-1.75)","v":-1.75}]
[{"$f":"IF(ModelNo=B331,11,\"\")","v":""},"A175","Egress Opening Width",{"$f":"IF(ISERROR(EW),\"N/A\",EW)","v":"N/A"}]
[{"$f":"IF(ModelNo=B332,12,\"\")","v":""},"A175","Egress Opening Height",{"$f":"IF(ISERROR(EH),\"N/A\",EH)","v":"N/A"}]
[{"$f":"IF(ModelNo=B333,13,\"\")","v":""},"A175","Egress Opening Area (sq.ft.)",{"$f":"IF(ISERROR(EO),\"N/A\",EO)","v":"N/A"}]
[{"$f":"IF(OR(ModelNo=\"A191\",ModelNo=\"B191\"),1,\"\")","v":""},"A191","Sash Width",{"$f":"Frame_Width-2.5","v":-2.5}]
[{"$f":"IF(OR(ModelNo=\"A191\",ModelNo=\"B191\"),2,\"\")","v":""},"A191","Sash Height",{"$f":"Frame_Height-2.5","v":-2.5}]
[{"$f":"IF(OR(ModelNo=\"A191\",ModelNo=\"B191\"),3,\"\")","v":""},"A191","Sash Glass Width",{"$f":"D334-8.0625","v":-10.5625}]
[{"$f":"IF(OR(ModelNo=\"A191\",ModelNo=\"B191\"),4,\"\")","v":""},"A191","Sash Glass Height",{"$f":"D335-8.0625","v":-10.5625}]
[{"$f":"IF(OR(ModelNo=\"A191\",ModelNo=\"B191\"),5,\"\")","v":""},"A191","Glass Area (sq.ft.)",{"$f":"(D336*D337)/144","v":0.77476671006944442}]
[{"$f":"IF(OR(ModelNo=\"A192\",ModelNo=\"B192\"),1,\"\")","v":""},"A192","Sash Width",{"$f":"A192CDIM-1.75","v":-1.75}]
[{"$f":"IF(OR(ModelNo=\"A192\",ModelNo=\"B192\"),2,\"\")","v":""},"A192","Sash Height",{"$f":"Frame_Height-2.5","v":-2.5}]
[{"$f":"IF(OR(ModelNo=\"A192\",ModelNo=\"B192\"),3,\"\")","v":""},"A192","Sash Glass Width",{"$f":"D339-8.0625","v":-9.8125}]
[{"$f":"IF(OR(ModelNo=\"A192\",ModelNo=\"B192\"),4,\"\")","v":""},"A192","Sash Glass Height",{"$f":"D340-8.0625","v":-10.5625}]
[{"$f":"IF(OR(ModelNo=\"A192\",ModelNo=\"B192\"),5,\"\")","v":""},"A192","Fixed Glass Width",{"$f":"A192DDIM-1.75","v":-1.75}]
[{"$f":"IF(OR(ModelNo=\"A192\",ModelNo=\"B192\"),6,\"\")","v":""},"A192","Fixed Glass Height",{"$f":"Frame_Height-2.5","v":-2.5}]
[{"$f":"IF(OR(ModelNo=\"A192\",ModelNo=\"B192\"),7,\"\")","v":""},"A192","Screen Width",{"$f":"A192CDIM+0.125","v":0.125}]
[{"$f":"IF(OR(ModelNo=\"A192\",ModelNo=\"B192\"),8,\"\")","v":""},"A192","Screen Height",{"$f":"Frame_Height-2.625","v":-2.625}]
[{"$f":"IF(OR(ModelNo=\"A193\",ModelNo=\"B193\"),1,\"\")","v":""},"A193","Sash Width",{"$f":"A193CDIM-1.75","v":-1.75}]
[{"$f":"IF(OR(ModelNo=\"A193\",ModelNo=\"B193\"),2,\"\")","v":""},"A193","Sash Height",{"$f":"Frame_Height-2.5","v":-2.5}]
[{"$f":"IF(OR(ModelNo=\"A193\",ModelNo=\"B193\"),3,\"\")","v":""},"A193","Sash Glass Width",{"$f":"D347-8.0625","v":-9.8125}]
[{"$f":"IF(OR(ModelNo=\"A193\",ModelNo=\"B193\"),4,\"\")","v":""},"A193","Sash Glass Height",{"$f":"D348-8.0625","v":-10.5625}]
[{"$f":"IF(OR(ModelNo=\"A193\",ModelNo=\"B193\"),5,\"\")","v":""},"A193","Fixed Glass Width",{"$f":"A193DDIM-1.75","v":-1.75}]
[{"$f":"IF(OR(ModelNo=\"A193\",ModelNo=\"B193\"),6,\"\")","v":""},"A193","Fixed Glass Height",{"$f":"Frame_Height-2.5","v":-2.5}]
[{"$f":"IF(OR(ModelNo=\"A194\",ModelNo=\"B194\"),1,\"\")","v":""},"A194","Sash Width",{"$f":"Frame_Width-2.25","v":-2.25}]
[{"$f":"IF(OR(ModelNo=\"A194\",ModelNo=\"B194\"),2,\"\")","v":""},"A194","Sash Height",{"$f":"Frame_Height-2.5","v":-2.5}]
[{"$f":"IF(OR(ModelNo=\"A194\",ModelNo=\"B194\"),3,\"\")","v":""},"A194","Sash Glass Width",{"$f":"D353-8.0625","v":-10.3125}]
[{"$f":"IF(OR(ModelNo=\"A194\",ModelNo=\"B194\"),4,\"\")","v":""},"A194","Sash Glass Height",{"$f":"D354-8.0625","v":-10.5625}]
[{"$f":"IF(OR(ModelNo=\"A194\",ModelNo=\"B194\"),5,\"\")","v":""},"A194","Glass Area (sq.ft.)",{"$f":"(D355*D356)/144","v":0.75642903645833337}]
[{"$f":"IF(OR(ModelNo=\"A195\",ModelNo=\"B195\"),1,\"\")","v":""},"A195","Sash Width",{"$f":"A195CDIM-1.625","v":-1.625}]
[{"$f":"IF(OR(ModelNo=\"A195\",ModelNo=\"B195\"),2,\"\")","v":""},"A195","Sash Height",{"$f":"Frame_Height-2.5","v":-2.5}]
[{"$f":"IF(OR(ModelNo=\"A195\",ModelNo=\"B195\"),3,\"\")","v":""},"A195","Sash Glass Width",{"$f":"D358-8.0625","v":-9.6875}]
[{"$f":"IF(OR(ModelNo=\"A195\",ModelNo=\"B195\"),4,\"\")","v":""},"A195","Sash Glass Height",{"$f":"D359-8.0625","v":-10.5625}]
[{"$f":"IF(OR(ModelNo=\"A195\",ModelNo=\"B195\"),5,\"\")","v":""},"A195","Glass Area (sq.ft.)",{"$f":"(D360*D361)/144","v":0.71058485243055558}]
[{"$f":"IF(ModelNo=B363,1,\"\")","v":""},"A501","Top Sash Width",{"$f":"Frame_Width-4.875","v":-4.875}]
[{"$f":"IF(ModelNo=B364,2,\"\")","v":""},"A501","Top Sash Height",{"$f":"TRUNC((A501DDIM-1.6875)*32+0.5)/32","v":-1.65625}]
[{"$f":"IF(ModelNo=B365,3,\"\")","v":""},"A501","Bottom Sash Width",{"$f":"Frame_Width-3.875","v":-3.875}]
[{"$f":"IF(ModelNo=B366,4,\"\")","v":""},"A501","Bottom Sash Height",{"$f":"TRUNC((A501CDIM-0.6875)*32+0.5)/32","v":-0.65625}]
[{"$f":"IF(ModelNo=B367,5,\"\")","v":""},"A501","Top Glass Width",{"$f":"CMR!L77","v":-6.6875}]
[{"$f":"IF(ModelNo=B368,6,\"\")","v":""},"A501","Top Glass Height",{"$f":"CMR!L79","v":-3.46875}]
[{"$f":"IF(ModelNo=B369,7,\"\")","v":""},"A501","Bottom Glass Width",{"$f":"CMR!L78","v":-6.6875}]
[{"$f":"IF(ModelNo=B370,8,\"\")","v":""},"A501","Bottom Glass Height",{"$f":"CMR!L80","v":-3.46875}]
[{"$f":"IF(ModelNo=B371,9,\"\")","v":""},"A501","Screen Width",{"$f":"Frame_Width-5.25","v":-5.25}]
[{"$f":"IF(ModelNo=B372,10,\"\")","v":""},"A501","Screen Height",{"$f":"IF(Screen=\"F\",Frame_Height-3.6875,IF(Screen=\"L\",TRUNC((CMR!$L$75-2.344)*16+0.5)/16,CMR!$L$75-1.1875))","v":-1.1875}]
[{"$f":"IF(ModelNo=B373,11,\"\")","v":""},"A501","Top Sash Weight (Plus 5 lb)",{"$f":"IF(ISERROR(TOP_WGT&\" \"&\"lb\"),\"N/A\",TOP_WGT&\" \"&\"lb\")","v":"N/A"}]
[{"$f":"IF(ModelNo=B374,12,\"\")","v":""},"A501","Top Balance Size (C.F)",{"$f":"IF(ISERROR((VLOOKUP(TOP_WGT,CFB,2,FALSE))&(VLOOKUP(TOP_WGT,CFB,3,FALSE))),\"N/A\",(VLOOKUP(TOP_WGT,CFB,2,FALSE))&(VLOOKUP(TOP_WGT,CFB,3,FALSE)))","v":"N/A"}]
[{"$f":"IF(ModelNo=B375,13,\"\")","v":""},"A501","Top Balance Size (Block & Tackle)",{"$f":"IF(ISERROR(TOP_BT),\"\",TOP_BT)","v":""}]
[{"$f":"IF(ModelNo=B376,14,\"\")","v":""},"A501","Bottom Sash Weight",{"$f":"IF(ISERROR(BTM_WGT&\" \"&\"lb\"),\"N/A\",BTM_WGT&\" \"&\"lb\")","v":"N/A"}]
[{"$f":"IF(ModelNo=B377,15,\"\")","v":""},"A501","Bottom Balance Size (C.F)",{"$f":"IF(ISERROR((VLOOKUP(BTM_WGT,CFB,2,FALSE))&(VLOOKUP(BTM_WGT,CFB,3,FALSE))),\"N/A\",(VLOOKUP(BTM_WGT,CFB,2,FALSE))&(VLOOKUP(BTM_WGT,CFB,3,FALSE)))","v":"N/A"}]
[{"$f":"IF(ModelNo=B378,16,\"\")","v":""},"A501","Bottom Balance Size (Block & Tackle)",{"$f":"IF(ISERROR(BTM_BT),\"\",BTM_BT)","v":""}]
[{"$f":"IF(ModelNo=B379,17,\"\")","v":""},"A501","Egress Opening Width",{"$f":"EW","v":{"$error":"#N/A"}}]
[{"$f":"IF(ModelNo=B380,18,\"\")","v":""},"A501","Egress Opening Height",{"$f":"EH","v":{"$error":"#N/A"}}]
[{"$f":"IF(ModelNo=B381,19,\"\")","v":""},"A501","Egress Opening Area (sq.ft.)",{"$f":"EO","v":{"$error":"#N/A"}}]
[{"$f":"IF(ModelNo=B382,1,\"\")","v":""},"A502","Sash Width",{"$f":"(Frame_Width/2)-0.625","v":-0.625}]
[{"$f":"IF(ModelNo=B383,2,\"\")","v":""},"A502","Sash Height",{"$f":"Frame_Height-4.625","v":-4.625}]
[{"$f":"IF(ModelNo=B384,3,\"\")","v":""},"A502","Roller Track Length",{"$f":"Frame_Width-3.125","v":-3.125}]
[{"$f":"IF(ModelNo=B385,4,\"\")","v":""},"A502","Glass Width",{"$f":"Frame_Width/2-3.5","v":-3.5}]
[{"$f":"IF(ModelNo=B386,5,\"\")","v":""},"A502","Glass Height",{"$f":"Frame_Height-7.5","v":-7.5}]
[{"$f":"IF(ModelNo=B387,6,\"\")","v":""},"A502","Screen Width",{"$f":"IF(Screen=\"F\",INT((Frame_Width-4.882)*16+0.5)/16,IF(Screen=\"H\",INT(((Frame_Width/2)-2.69)*16+0.5)/16,\"N/A\"))","v":-2.6875}]
[{"$f":"IF(ModelNo=B388,7,\"\")","v":""},"A502","Screen Height",{"$f":"INT((Frame_Height-4.651)*16+0.5)/16","v":-4.625}]
[{"$f":"IF(ModelNo=B389,8,\"\")","v":""},"A502","Egress Opening Width",{"$f":"TRUNC((Frame_Width/2-6.438)*16+0.5)/16","v":-6.375}]
[{"$f":"IF(ModelNo=B390,9,\"\")","v":""},"A502","Egress Opening Height",{"$f":"TRUNC((Frame_Height-5.75)*16+0.5)/16","v":-5.6875}]
[{"$f":"IF(ModelNo=B391,10,\"\")","v":""},"A502","Egress Opening Area (sq.ft.)",{"$f":"(D389*D390)/144","v":0.25179036458333331}]
[{"$f":"IF(ModelNo=B392,1,\"\")","v":""},"A503","Operating Sash Width",{"$f":"(Frame_Width/4)+0.875","v":0.875}]
[{"$f":"IF(ModelNo=B393,2,\"\")","v":""},"A503","Operating Sash Height",{"$f":"Frame_Height-4.625","v":-4.625}]
[{"$f":"IF(ModelNo=B394,3,\"\")","v":""},"A503","Fixed Sash Width",{"$f":"(Frame_Width-(2*(Frame_Width/4)))-1.0625","v":-1.0625}]
[{"$f":"IF(ModelNo=B395,4,\"\")","v":""},"A503","Fixed Sash Height",{"$f":"Frame_Height-4.625","v":-4.625}]
[{"$f":"IF(ModelNo=B396,5,\"\")","v":""},"A503","Roller Track Length",{"$f":"Frame_Width-3.125","v":-3.125}]
[{"$f":"IF(ModelNo=B397,6,\"\")","v":""},"A503","Operating Sash Glass Width",{"$f":"TRUNC((Frame_Width/4-1.96875)*32+0.5)/32","v":-1.9375}]
[{"$f":"IF(ModelNo=B398,7,\"\")","v":""},"A503","Operating Sash Glass Height",{"$f":"Frame_Height-7.46875","v":-7.46875}]
[{"$f":"IF(ModelNo=B399,8,\"\")","v":""},"A503","Fixed Sash Glass Width",{"$f":"TRUNC((Frame_Width-(2*(Frame_Width/4))-3.90625)*32+0.5)/32","v":-3.875}]
[{"$f":"IF(ModelNo=B400,9,\"\")","v":""},"A503","Fixed Sash Glass Height",{"$f":"Frame_Height-7.46875","v":-7.46875}]
[{"$f":"IF(ModelNo=B401,10,\"\")","v":""},"A503","Screen Width",{"$f":"IF(Screen=\"F\",INT((Frame_Width-4.882)*16+0.5)/16,IF(Screen=\"H\",INT(((Frame_Width/4)-0.938)*16+0.5)/16,\"N/A\"))","v":-0.9375}]
[{"$f":"IF(ModelNo=B402,11,\"\")","v":""},"A503","Screen Height",{"$f":"INT((Frame_Height-4.65)*16+0.5)/16","v":-4.625}]
[{"$f":"IF(ModelNo=B403,12,\"\")","v":""},"A503","Egress Opening Width",{"$f":"(Frame_Width/4)-2.125","v":-2.125}]
[{"$f":"IF(ModelNo=B404,13,\"\")","v":""},"A503","Egress Opening Height",{"$f":"Frame_Height-5.75","v":-5.75}]
[{"$f":"IF(ModelNo=B405,14,\"\")","v":""},"A503","Egress Opening Area (sq.ft.)",{"$f":"(D403*D404)/144","v":8.4852430555555552E-2}]
[{"$f":"IF(ModelNo=B406,1,\"\")","v":""},"A509","Operating Sash Width",{"$f":"(INT(((Frame_Width/3)-0.656)*16)/16)+0.875","v":0.1875}]
[{"$f":"IF(ModelNo=B407,2,\"\")","v":""},"A509","Operating Sash Height",{"$f":"Frame_Height-4.625","v":-4.625}]
[{"$f":"IF(ModelNo=B408,3,\"\")","v":""},"A509","Fixed Sash Width",{"$f":"(INT((((INT(((Frame_Width/3)-0.656)*16)/16))+1.938)*16+0.5)/16)-1.0625","v":0.1875}]
[{"$f":"IF(ModelNo=B409,4,\"\")","v":""},"A509","Fixed Sash Height",{"$f":"Frame_Height-4.625","v":-4.625}]
[{"$f":"IF(ModelNo=B410,5,\"\")","v":""},"A509","Roller Track Length",{"$f":"Frame_Width-3.125","v":-3.125}]
[{"$f":"IF(ModelNo=B411,6,\"\")","v":""},"A509","Operating Sash Glass Width",{"$f":"INT(((INT((Frame_Width/3-0.656)*16)/16)-1.96875)*32+0.5)/32","v":-2.65625}]
[{"$f":"IF(ModelNo=B412,7,\"\")","v":""},"A509","Operating Sash Glass Height",{"$f":"Frame_Height-7.46875","v":-7.46875}]
[{"$f":"IF(ModelNo=B413,8,\"\")","v":""},"A509","Fixed Sash Glass Width",{"$f":"INT(((INT((Frame_Width/3-0.656)*16)/16)-1.96875)*32+0.5)/32","v":-2.65625}]
[{"$f":"IF(ModelNo=B414,9,\"\")","v":""},"A509","Fixed Sash Glass Height",{"$f":"Frame_Height-7.46875","v":-7.46875}]
[{"$f":"IF(ModelNo=B415,10,\"\")","v":""},"A509","Screen Width",{"$f":"IF(Screen=\"F\",INT((Frame_Width-4.882)*16+0.5)/16,IF(Screen=\"H\",INT(((TRUNC(((Frame_Width/3)-0.656)*16)/16)-0.938)*16+0.5)/16,\"N/A\"))","v":-1.5625}]
[{"$f":"IF(ModelNo=B416,11,\"\")","v":""},"A509","Screen Height",{"$f":"INT((Frame_Height-4.65)*16+0.5)/16","v":-4.625}]
[{"$f":"IF(ModelNo=B417,12,\"\")","v":""},"A509","Egress Opening Width",{"$f":"(Frame_Width/3)-4.625","v":-4.625}]
[{"$f":"IF(ModelNo=B418,13,\"\")","v":""},"A509","Egress Opening Height",{"$f":"Frame_Height-5.75","v":-5.75}]
[{"$f":"IF(ModelNo=B419,14,\"\")","v":""},"A509","Egress Opening Area (sq.ft.)",{"$f":"(D417*D418)/144","v":0.18467881944444445}]
[{"$f":"IF(ModelNo=B420,1,\"\")","v":""},"A504","Glass Width",{"$f":"Frame_Width-4.625","v":-4.625}]
[{"$f":"IF(ModelNo=B421,2,\"\")","v":""},"A504","Glass Height",{"$f":"Frame_Height-4.625","v":-4.625}]
[{"$f":"IF(ModelNo=B422,3,\"\")","v":""},"A504","Glass Area (sq.ft.)",{"$f":"(D420*D421)/144","v":0.14854600694444445}]
[{"$f":"IF(ModelNo=B423,4,\"\")","v":""},"A504",{"$f":"IF(MAX_SHORT=1,\"Max Short Glass Must be Less Than \"&MAX_SG,\"\")","v":{"$error":"#N/A"}}]
[{"$f":"IF(OR(ModelNo=\"6302\",ModelNo=\"6305\",ModelNo=\"6306\",ModelNo=\"6308\",ModelNo=\"6375\"),1,\"\")","v":""},6302,"Sash Width",{"$f":"(Frame_Width/2)-0.0625","v":-6.25E-2}]
[{"$f":"IF(OR(ModelNo=\"6302\",ModelNo=\"6305\",ModelNo=\"6306\",ModelNo=\"6308\",ModelNo=\"6375\"),2,\"\")","v":""},6302,"Sash Height",{"$f":"Frame_Height-3.25","v":-3.25}]
[{"$f":"IF(OR(ModelNo=\"6302\",ModelNo=\"6305\",ModelNo=\"6306\",ModelNo=\"6308\",ModelNo=\"6375\"),3,\"\")","v":""},6302,"Operating Sash Roller Track Length",{"$f":"Frame_Width-1.875","v":-1.875}]
[{"$f":"IF(OR(ModelNo=\"6302\",ModelNo=\"6305\",ModelNo=\"6306\",ModelNo=\"6308\",ModelNo=\"6375\"),4,\"\")","v":""},6302,"Screen Roller Track Length",{"$f":"Frame_Width-1.8125","v":-1.8125}]
[{"$f":"IF(OR(ModelNo=\"6302\",ModelNo=\"6305\",ModelNo=\"6306\",ModelNo=\"6308\",ModelNo=\"6375\"),5,\"\")","v":""},6302,"Fixed Panel Support",{"$f":"(Frame_Width/2)-0.1875","v":-0.1875}]
[{"$f":"IF(OR(ModelNo=\"6302\",ModelNo=\"6305\",ModelNo=\"6306\",ModelNo=\"6308\",ModelNo=\"6375\"),6,\"\")","v":""},6302,"Glass Width",{"$f":"(Frame_Width/2)-3.6875","v":-3.6875}]
[{"$f":"IF(OR(ModelNo=\"6302\",ModelNo=\"6305\",ModelNo=\"6306\",ModelNo=\"6308\",ModelNo=\"6375\"),7,\"\")","v":""},6302,"Glass Height",{"$f":"Frame_Height-6.875","v":-6.875}]
[{"$f":"IF(OR(ModelNo=\"6302\",ModelNo=\"6305\",ModelNo=\"6306\",ModelNo=\"6308\",ModelNo=\"6375\"),8,\"\")","v":""},6302,"Screen Width",{"$f":"(Frame_Width/2)-1.5","v":-1.5}]
[{"$f":"IF(OR(ModelNo=\"6302\",ModelNo=\"6305\",ModelNo=\"6306\",ModelNo=\"6308\",ModelNo=\"6375\"),9,\"\")","v":""},6302,"Screen Height",{"$f":"Frame_Height-2.75","v":-2.75}]
[{"$f":"IF(OR(ModelNo=\"6302\",ModelNo=\"6305\",ModelNo=\"6306\",ModelNo=\"6308\",ModelNo=\"6375\"),10,\"\")","v":""},6302,"Egress Opening Width",{"$f":"Frame_Width-D424-((2.108*2)+2.5)","v":-6.6535000000000002}]
[{"$f":"IF(OR(ModelNo=\"6302\",ModelNo=\"6305\",ModelNo=\"6306\",ModelNo=\"6308\",ModelNo=\"6375\"),11,\"\")","v":""},6302,"Egress Opening Height",{"$f":"Frame_Height-(2.108*2)","v":-4.2160000000000002}]
[{"$f":"IF(OR(ModelNo=\"6302\",ModelNo=\"6305\",ModelNo=\"6306\",ModelNo=\"6308\",ModelNo=\"6375\"),12,\"\")","v":""},6302,"Egress Opening Area (sq.ft.)",{"$f":"(D433*D434)/144","v":0.19479969444444445}]
[{"$f":"IF(OR(ModelNo=\"6303\",ModelNo=\"6309\",ModelNo=\"6322\"),1,\"\")","v":""},6303,"Sash Width",{"$f":"TRUNC(((Frame_Width+0.375)/3)*16+0.5)/16","v":0.125}]
[{"$f":"IF(OR(ModelNo=\"6303\",ModelNo=\"6309\",ModelNo=\"6322\"),2,\"\")","v":""},6303,"Sash Height",{"$f":"Frame_Height-3.25","v":-3.25}]
[{"$f":"IF(OR(ModelNo=\"6303\",ModelNo=\"6309\",ModelNo=\"6322\"),3,\"\")","v":""},6303,"Operating Sash Roller Track Length",{"$f":"TRUNC((((2*Frame_Width)-4.3125)/3)*16+0.5)/16","v":-1.375}]
[{"$f":"IF(OR(ModelNo=\"6303\",ModelNo=\"6309\",ModelNo=\"6322\"),4,\"\")","v":""},6303,"Screen Roller Track Length",{"$f":"TRUNC(((Frame_Width-0.75)/3)*16+0.5)/16","v":-0.1875}]
[{"$f":"IF(OR(ModelNo=\"6303\",ModelNo=\"6309\",ModelNo=\"6322\"),5,\"\")","v":""},6303,"Fixed Panel Support",{"$f":"TRUNC((Frame_Width/3)*16+0.5)/16","v":0}]
[{"$f":"IF(OR(ModelNo=\"6303\",ModelNo=\"6309\",ModelNo=\"6322\"),6,\"\")","v":""},6303,"Glass Width",{"$f":"TRUNC(((Frame_Width/3)-3.5)*16+0.5)/16","v":-3.4375}]
[{"$f":"IF(OR(ModelNo=\"6303\",ModelNo=\"6309\",ModelNo=\"6322\"),7,\"\")","v":""},6303,"Glass Height",{"$f":"Frame_Height-6.875","v":-6.875}]
[{"$f":"IF(OR(ModelNo=\"6303\",ModelNo=\"6309\",ModelNo=\"6322\"),8,\"\")","v":""},6303,"Screen Width",{"$f":"TRUNC(((Frame_Width-3.9375)/3)*16+0.5)/16","v":-1.25}]
[{"$f":"IF(OR(ModelNo=\"6303\",ModelNo=\"6309\",ModelNo=\"6322\"),9,\"\")","v":""},6303,"Screen Height",{"$f":"Frame_Height-2.75","v":-2.75}]
[{"$f":"IF(OR(ModelNo=\"6303\",ModelNo=\"6309\",ModelNo=\"6322\"),10,\"\")","v":""},6303,"Egress Opening Width",{"$f":"Frame_Width-(2.108*2)-(D436*2)-2.5-0.5","v":-7.4660000000000002}]
[{"$f":"IF(OR(ModelNo=\"6303\",ModelNo=\"6309\",ModelNo=\"6322\"),11,\"\")","v":""},6303,"Egress Opening Height",{"$f":"Frame_Height-(2.108*2)","v":-4.2160000000000002}]
[{"$f":"IF(OR(ModelNo=\"6303\",ModelNo=\"6309\",ModelNo=\"6322\"),12,\"\")","v":""},6303,"Egress Opening Area (sq.ft.)",{"$f":"(D445*D446)/144","v":0.21858788888888891}]
[{"$f":"IF(OR(ModelNo=\"6304\",ModelNo=\"6312\"),1,\"\")","v":""},6304,"Sash Width",{"$f":"(TRUNC(((Frame_Width+1.375)/4)*16+0.5)/16)+0.4375","v":0.8125}]
[{"$f":"IF(OR(ModelNo=\"6304\",ModelNo=\"6312\"),2,\"\")","v":""},6304,"Sash Height",{"$f":"Frame_Height-3.25","v":-3.25}]
[{"$f":"IF(OR(ModelNo=\"6304\",ModelNo=\"6312\"),3,\"\")","v":""},6304,"Operating Sash Roller Track Length",{"$f":"Frame_Width-1.875","v":-1.875}]
[{"$f":"IF(OR(ModelNo=\"6304\",ModelNo=\"6312\"),4,\"\")","v":""},6304,"Screen Roller Track Length",{"$f":"Frame_Width-1.8125","v":-1.8125}]
[{"$f":"IF(OR(ModelNo=\"6304\",ModelNo=\"6312\"),5,\"\")","v":""},6304,"Fixed Panel Support",{"$f":"TRUNC(((Frame_Width+0.875)/4)*16+0.5)/16","v":0.25}]
[{"$f":"IF(OR(ModelNo=\"6304\",ModelNo=\"6312\"),6,\"\")","v":""},6304,"Glass Width",{"$f":"TRUNC(((Frame_Width/4)-3.281)*16+0.5)/16","v":-3.1875}]
[{"$f":"IF(OR(ModelNo=\"6304\",ModelNo=\"6312\"),7,\"\")","v":""},6304,"Glass Height",{"$f":"Frame_Height-6.875","v":-6.875}]
[{"$f":"IF(OR(ModelNo=\"6304\",ModelNo=\"6312\"),8,\"\")","v":""},6304,"Screen Width",{"$f":"TRUNC(((Frame_Width/4)-1.125)*16+0.5)/16","v":-1.0625}]
[{"$f":"IF(OR(ModelNo=\"6304\",ModelNo=\"6312\"),9,\"\")","v":""},6304,"Screen Height",{"$f":"Frame_Height-2.75","v":-2.75}]
[{"$f":"IF(OR(ModelNo=\"6304\",ModelNo=\"6312\"),10,\"\")","v":""},6304,"Egress Opening Width",{"$f":"Frame_Width-(D448*2)-(2.108*2)-(2.5*2)-0.875","v":-11.716000000000001}]
[{"$f":"IF(OR(ModelNo=\"6304\",ModelNo=\"6312\"),11,\"\")","v":""},6304,"Egress Opening Height",{"$f":"Frame_Height-(2.108*2)","v":-4.2160000000000002}]
[{"$f":"IF(OR(ModelNo=\"6304\",ModelNo=\"6312\"),12,\"\")","v":""},6304,"Egress Opening Area (sq.ft.)",{"$f":"(D457*D458)/144","v":0.34301844444444446}]
[{"$f":"IF(ModelNo=B460,1,\"\")","v":""},"02S0","Bottom Sash Width",{"$f":"Frame_Width-2.25","v":-2.25}]
[{"$f":"IF(ModelNo=B461,2,\"\")","v":""},"02S0","Bottom Sash Height",{"$f":"S0CDIM-0.75","v":-0.75}]
[{"$f":"IF(ModelNo=B462,3,\"\")","v":""},"02S0","Bottom Glass Width",{"$f":"CMR!L30","v":-3.875}]
[{"$f":"IF(ModelNo=B463,4,\"\")","v":""},"02S0","Bottom Glass Height",{"$f":"CMR!L32","v":-2.375}]
[{"$f":"IF(ModelNo=B464,5,\"\")","v":""},"02S0","Top Glass Width",{"$f":"CMR!L29","v":-3.375}]
[{"$f":"IF(ModelNo=B465,6,\"\")","v":""},"02S0","Top Glass Height",{"$f":"CMR!L31","v":-2.1875}]
[{"$f":"IF(ModelNo=B466,7,\"\")","v":""},"02S0","Astragal Length",{"$f":"TRUNC((Frame_Width-2.868)*16+0.5)/16","v":-2.8125}]
[{"$f":"IF(ModelNo=B467,8,\"\")","v":""},"02S0","Screen Width",{"$f":"IF(Screen=\"L\",Frame_Width-1.6875,Frame_Width-3.6875)","v":-3.6875}]
[{"$f":"IF(ModelNo=B468,9,\"\")","v":""},"02S0","Screen Height",{"$f":"IF(Screen=\"L\",TRUNC((S0CDIM-1.75)*16+0.5)/16,IF(Screen=\"F\",TRUNC((Frame_Height-2.875)*16+0.5)/16,TRUNC((S0CDIM-0.75)*16+0.5)/16))","v":-0.6875}]
[{"$f":"IF(ModelNo=B469,10,\"\")","v":""},"02S0","Bottom Sash Weight",{"$f":"IF(ISERROR(BTM_WGT&\" \"&\"lb\"),\"N/A\",BTM_WGT&\" \"&\"lb\")","v":"N/A"}]
[{"$f":"IF(ModelNo=B470,11,\"\")","v":""},"02S0","Balance Size",{"$f":"IF(ISERROR((VLOOKUP(BTM_WGT,CFB,2,FALSE))&(VLOOKUP(BTM_WGT,CFB,3,FALSE))),\"N/A\",(VLOOKUP(BTM_WGT,CFB,2,FALSE))&(VLOOKUP(BTM_WGT,CFB,3,FALSE)))","v":"N/A"}]
[{"$f":"IF(ModelNo=B471,12,\"\")","v":""},"02S0","Egress Opening Width",{"$f":"IF(ISERROR(EW),\"N/A\",EW)","v":"N/A"}]
[{"$f":"IF(ModelNo=B472,13,\"\")","v":""},"02S0","Egress Opening Height",{"$f":"IF(ISERROR(EH),\"N/A\",EH)","v":"N/A"}]
[{"$f":"IF(ModelNo=B473,14,\"\")","v":""},"02S0","Egress Opening Area (sq.ft.)",{"$f":"IF(ISERROR(EO),\"N/A\",EO)","v":"N/A"}]
[{"$f":"IF(ModelNo=B474,1,\"\")","v":""},"02S2","Sash Width",{"$f":"TRUNC((S2CDIM-0.403)*32+0.5)/32","v":-0.375}]
[{"$f":"IF(ModelNo=B475,2,\"\")","v":""},"02S2","Sash Height",{"$f":"Frame_Height-2.4375","v":-2.4375}]
[{"$f":"IF(ModelNo=B476,3,\"\")","v":""},"02S2","Roller Track Length",{"$f":"Frame_Width-1","v":-1}]
[{"$f":"IF(ModelNo=B477,4,\"\")","v":""},"02S2","Sash Glass Width",{"$f":"TRUNC((S2CDIM-2.05939)*32+0.5)/32","v":-2.03125}]
[{"$f":"IF(ModelNo=B478,5,\"\")","v":""},"02S2","Sash Glass Height",{"$f":"TRUNC((Frame_Height-4.09375)*32+0.5)/32","v":-4.0625}]
[{"$f":"IF(ModelNo=B479,6,\"\")","v":""},"02S2","Fixed Glass Width",{"$f":"TRUNC((S2DDIM-2.09686)*32+0.5)/32","v":-2.0625}]
[{"$f":"IF(ModelNo=B480,7,\"\")","v":""},"02S2","Fixed Glass Height",{"$f":"TRUNC((Frame_Height-3.41634)*32+0.5)/32","v":-3.375}]
[{"$f":"IF(ModelNo=B481,8,\"\")","v":""},"02S2","Screen Width",{"$f":"IF(Screen=\"F\",Frame_Width-4.125,IF(Screen=\"L\",\"N/A\",TRUNC((S2CDIM-2.02638)*16+0.5)/16))","v":-1.9375}]
[{"$f":"IF(ModelNo=B482,9,\"\")","v":""},"02S2","Screen Height",{"$f":"IF(Screen=\"L\",\"N/A\",IF(Screen=\"H\",Frame_Height-3.688,Frame_Height-3.75))","v":-3.6880000000000002}]
[{"$f":"IF(ModelNo=B483,10,\"\")","v":""},"02S2","Egress Opening Width",{"$f":"IF(ISERROR(EW),\"N/A\",EW)","v":"N/A"}]
[{"$f":"IF(ModelNo=B484,11,\"\")","v":""},"02S2","Egress Opening Height",{"$f":"IF(ISERROR(EH),\"N/A\",EH)","v":"N/A"}]
[{"$f":"IF(ModelNo=B485,12,\"\")","v":""},"02S2","Egress Opening Area (sq.ft.)",{"$f":"IF(ISERROR(EO),\"N/A\",EO)","v":"N/A"}]
[{"$f":"IF(ModelNo=B486,1,\"\")","v":""},"02S3","Operating Sash Width",{"$f":"TRUNC(((S3CDIM-0.1875))*32+0.5)/32","v":0.71875}]
[{"$f":"IF(ModelNo=B487,2,\"\")","v":""},"02S3","Operating Sash Height",{"$f":"TRUNC((Frame_Height-2.4375)*32+0.5)/32","v":-2.40625}]
[{"$f":"IF(ModelNo=B488,3,\"\")","v":""},"02S3","Astragal Length",{"$f":"TRUNC((Frame_Height-2.868)*32+0.5)/32","v":-2.84375}]
[{"$f":"IF(ModelNo=B489,4,\"\")","v":""},"02S3","Roller Track Length",{"$f":"Frame_Width-1","v":-1}]
[{"$f":"IF(ModelNo=B490,5,\"\")","v":""},"02S3","Operating Sash Glass Width",{"$f":"TRUNC(((TRUNC(((S3CDIM-0.1875))*32+0.5)/32)-1.65625)*32+0.5)/32","v":-0.90625}]
[{"$f":"IF(ModelNo=B491,6,\"\")","v":""},"02S3","Operating Sash Glass Height",{"$f":"TRUNC(((TRUNC((Frame_Height-2.4375)*32+0.5)/32)-1.65625)*32+0.5)/32","v":-4.03125}]
[{"$f":"IF(ModelNo=B492,7,\"\")","v":""},"02S3","Fixed Glass Width",{"$f":"TRUNC((S3DDIM-1.14046)*32+0.5)/32","v":-2.875}]
[{"$f":"IF(ModelNo=B493,8,\"\")","v":""},"02S3","Fixed Glass Height",{"$f":"TRUNC((Frame_Height-3.41634)*32+0.5)/32","v":-3.375}]
[{"$f":"IF(ModelNo=B494,9,\"\")","v":""},"02S3","Screen Width",{"$f":"IF(Screen=\"F\",Frame_Width-4.0625,IF(Screen=\"L\",\"N/A\",TRUNC(((INT(S3CDIM*32+0.5)/32)-1.81075)*16+0.5)/16))","v":-0.8125}]
[{"$f":"IF(ModelNo=B495,10,\"\")","v":""},"02S3","Screen Height",{"$f":"TRUNC((Frame_Height-3.688)*16+0.5)/16","v":-3.625}]
[{"$f":"IF(ModelNo=B496,11,\"\")","v":""},"02S3","Egress Opening Width",{"$f":"IF(ISERROR(EW),\"N/A\",EW)","v":"N/A"}]
[{"$f":"IF(ModelNo=B497,12,\"\")","v":""},"02S3","Egress Opening Height",{"$f":"IF(ISERROR(EH),\"N/A\",EH)","v":"N/A"}]
[{"$f":"IF(ModelNo=B498,13,\"\")","v":""},"02S3","Egress Opening Area (sq.ft.)",{"$f":"IF(ISERROR(EO),\"N/A\",EO)","v":"N/A"}]
[{"$f":"IF(ModelNo=B499,1,\"\")","v":""},"02S9","Operating Sash Width",{"$f":"TRUNC(((S9CDIM-0.1875))*32+0.5)/32","v":6.25E-2}]
[{"$f":"IF(ModelNo=B500,2,\"\")","v":""},"02S9","Operating Sash Height",{"$f":"TRUNC((Frame_Height-2.4375)*32+0.5)/32","v":-2.40625}]
[{"$f":"IF(ModelNo=B501,3,\"\")","v":""},"02S9","Astragal Length",{"$f":"TRUNC((Frame_Height-2.868)*32+0.5)/32","v":-2.84375}]
[{"$f":"IF(ModelNo=B502,4,\"\")","v":""},"02S9","Roller Track Length",{"$f":"Frame_Width-1","v":-1}]
[{"$f":"IF(ModelNo=B503,5,\"\")","v":""},"02S9","Operating Sash Glass Width",{"$f":"TRUNC(((TRUNC(((S9CDIM-0.1875))*32+0.5)/32)-1.65625)*32+0.5)/32","v":-1.5625}]
[{"$f":"IF(ModelNo=B504,6,\"\")","v":""},"02S9","Operating Sash Glass Height",{"$f":"TRUNC(((TRUNC((Frame_Height-2.4375)*32+0.5)/32)-1.65625)*32+0.5)/32","v":-4.03125}]
[{"$f":"IF(ModelNo=B505,7,\"\")","v":""},"02S9","Fixed Glass Width",{"$f":"TRUNC((S9DDIM-1.14046)*32+0.5)/32","v":-1.5625}]
[{"$f":"IF(ModelNo=B506,8,\"\")","v":""},"02S9","Fixed Glass Height",{"$f":"TRUNC((Frame_Height-3.41634)*32+0.5)/32","v":-3.375}]
[{"$f":"IF(ModelNo=B507,9,\"\")","v":""},"02S9","Screen Width",{"$f":"IF(Screen=\"F\",Frame_Width-4.0625,IF(Screen=\"L\",\"N/A\",TRUNC(((INT(S9CDIM*32+0.5)/32)-1.81075)*16+0.5)/16))","v":-1.5}]
[{"$f":"IF(ModelNo=B508,10,\"\")","v":""},"02S9","Screen Height",{"$f":"TRUNC((Frame_Height-3.688)*16+0.5)/16","v":-3.625}]
[{"$f":"IF(ModelNo=B509,11,\"\")","v":""},"02S9","Egress Opening Width",{"$f":"IF(ISERROR(EW),\"N/A\",EW)","v":"N/A"}]
[{"$f":"IF(ModelNo=B510,12,\"\")","v":""},"02S9","Egress Opening Height",{"$f":"IF(ISERROR(EH),\"N/A\",EH)","v":"N/A"}]
[{"$f":"IF(ModelNo=B511,13,\"\")","v":""},"02S9","Egress Opening Area (sq.ft.)",{"$f":"IF(ISERROR(EO),\"N/A\",EO)","v":"N/A"}]
[{"$f":"IF(OR(ModelNo=\"6502\",ModelNo=\"6505\",ModelNo=\"6506\",ModelNo=\"6508\"),1,\"\")","v":""},"6502","Sash Width",{"$f":"IF(TYPE=2,TRUNC(((Frame_Width/2)+1)*16+0.5)/16,TRUNC(((Frame_Width/2)+0.1875)*16+0.5)/16)","v":0.1875}]
[{"$f":"IF(OR(ModelNo=\"6502\",ModelNo=\"6505\",ModelNo=\"6506\",ModelNo=\"6508\"),2,\"\")","v":""},"6502","Sash Height",{"$f":"Frame_Height-3.375","v":-3.375}]
[{"$f":"IF(OR(ModelNo=\"6502\",ModelNo=\"6505\",ModelNo=\"6506\",ModelNo=\"6508\"),3,\"\")","v":""},"6502","Operating Sash Roller Track Length",{"$f":"Frame_Width-8.1875","v":-8.1875}]
[{"$f":"IF(OR(ModelNo=\"6502\",ModelNo=\"6505\",ModelNo=\"6506\",ModelNo=\"6508\"),4,\"\")","v":""},"6502","Screen Roller Track Length",{"$f":"Frame_Width-3.0625","v":-3.0625}]
[{"$f":"IF(OR(ModelNo=\"6502\",ModelNo=\"6505\",ModelNo=\"6506\",ModelNo=\"6508\"),5,\"\")","v":""},"6502","Fixed Panel Support",{"$f":"TRUNC(((Frame_Width/2)-10)*32+0.5)/32","v":-9.96875}]
[{"$f":"IF(OR(ModelNo=\"6502\",ModelNo=\"6505\",ModelNo=\"6506\",ModelNo=\"6508\"),6,\"\")","v":""},"6502","Glass Width",{"$f":"IF(TYPE=2,TRUNC(((Frame_Width/2)-7.875)*16+0.5)/16,TRUNC(((Frame_Width/2)-5.1875)*16+0.5)/16)","v":-5.125}]
[{"$f":"IF(OR(ModelNo=\"6502\",ModelNo=\"6505\",ModelNo=\"6506\",ModelNo=\"6508\"),7,\"\")","v":""},"6502","Glass Height",{"$f":"IF(TYPE=1,TRUNC((Frame_Height-8.6875)*16+0.5)/16,IF(TYPE=2,TRUNC((Frame_Height-12.1875)*32+0.5)/32,IF(TYPE=3,TRUNC((Frame_Height-14.1875)*32+0.5)/32,\"\")))","v":-8.625}]
[{"$f":"IF(OR(ModelNo=\"6502\",ModelNo=\"6505\",ModelNo=\"6506\",ModelNo=\"6508\"),8,\"\")","v":""},"6502","Screen Width",{"$f":"(Frame_Width/2)-0.125","v":-0.125}]
[{"$f":"IF(OR(ModelNo=\"6502\",ModelNo=\"6505\",ModelNo=\"6506\",ModelNo=\"6508\"),9,\"\")","v":""},"6502","Screen Height",{"$f":"Frame_Height-2.9375","v":-2.9375}]
[{"$f":"IF(OR(ModelNo=\"6502\",ModelNo=\"6505\",ModelNo=\"6506\",ModelNo=\"6508\"),10,\"\")","v":""},"6502","Egress Opening Width",{"$f":"TRUNC((Frame_Width-D512-(2.176*2)-4)*16+0.5)/16","v":-8.5}]
[{"$f":"IF(OR(ModelNo=\"6502\",ModelNo=\"6505\",ModelNo=\"6506\",ModelNo=\"6508\"),11,\"\")","v":""},"6502","Egress Opening Height",{"$f":"Frame_Height-(2.25*2)","v":-4.5}]
[{"$f":"IF(OR(ModelNo=\"6502\",ModelNo=\"6505\",ModelNo=\"6506\",ModelNo=\"6508\"),12,\"\")","v":""},"6502","Egress Opening Area (sq.ft.)",{"$f":"(D522*D521)/144","v":0.265625}]
[{"$f":"IF(OR(ModelNo=\"6503\",ModelNo=\"6509\",ModelNo=\"6522\"),1,\"\")","v":""},"6503","Sash Width",{"$f":"IF(TYPE=2,TRUNC(((Frame_Width/3)+0.958)*16+0.5)/16,TRUNC(((Frame_Width/3)+0.333)*16+0.5)/16)","v":0.3125}]
[{"$f":"IF(OR(ModelNo=\"6503\",ModelNo=\"6509\",ModelNo=\"6522\"),2,\"\")","v":""},"6503","Sash Height",{"$f":"Frame_Height-3.375","v":-3.375}]
[{"$f":"IF(OR(ModelNo=\"6503\",ModelNo=\"6509\",ModelNo=\"6522\"),3,\"\")","v":""},"6503","Operating Sash Roller Track Length",{"$f":"Frame_Width-12.375","v":-12.375}]
[{"$f":"IF(OR(ModelNo=\"6503\",ModelNo=\"6509\",ModelNo=\"6522\"),4,\"\")","v":""},"6503","Screen Roller Track Length",{"$f":"Frame_Width-3.0625","v":-3.0625}]
[{"$f":"IF(OR(ModelNo=\"6503\",ModelNo=\"6509\",ModelNo=\"6522\"),5,\"\")","v":""},"6503","Fixed Panel Support",{"$f":"TRUNC(((Frame_Width/3)-9.854)*32+0.5)/32","v":-9.8125}]
[{"$f":"IF(OR(ModelNo=\"6503\",ModelNo=\"6509\",ModelNo=\"6522\"),6,\"\")","v":""},"6503","Glass Width",{"$f":"IF(TYPE=2,TRUNC(((Frame_Width/3)-7.917)*16+0.5)/16,TRUNC(((Frame_Width/3)-5.042)*16+0.5)/16)","v":-5}]
[{"$f":"IF(OR(ModelNo=\"6503\",ModelNo=\"6509\",ModelNo=\"6522\"),7,\"\")","v":""},"6503","Glass Height",{"$f":"IF(TYPE=1,TRUNC((Frame_Height-8.6875)*16+0.5)/16,IF(TYPE=2,TRUNC((Frame_Height-12.1875)*32+0.5)/32,IF(TYPE=3,TRUNC((Frame_Height-14.1875)*32+0.5)/32,\"\")))","v":-8.625}]
[{"$f":"IF(OR(ModelNo=\"6503\",ModelNo=\"6509\",ModelNo=\"6522\"),8,\"\")","v":""},"6503","Screen Width",{"$f":"TRUNC(((Frame_Width/3)+0.021)*16+0.5)/16","v":0}]
[{"$f":"IF(OR(ModelNo=\"6503\",ModelNo=\"6509\",ModelNo=\"6522\"),9,\"\")","v":""},"6503","Screen Height",{"$f":"Frame_Height-2.9375","v":-2.9375}]
[{"$f":"IF(OR(ModelNo=\"6503\",ModelNo=\"6509\",ModelNo=\"6522\"),10,\"\")","v":""},"6503","Egress Opening Width",{"$f":"(TRUNC((Frame_Width-(D524*2)-(2.176*2)-4)*16+0.5)/16)+0.875","v":-8.0625}]
[{"$f":"IF(OR(ModelNo=\"6503\",ModelNo=\"6509\",ModelNo=\"6522\"),11,\"\")","v":""},"6503","Egress Opening Height",{"$f":"Frame_Height-(2.25*2)","v":-4.5}]
[{"$f":"IF(OR(ModelNo=\"6503\",ModelNo=\"6509\",ModelNo=\"6522\"),12,\"\")","v":""},"6503","Egress Opening Area (sq.ft.)",{"$f":"(D534*D533)/144","v":0.251953125}]
[{"$f":"IF(OR(ModelNo=\"6504\",ModelNo=\"6512\"),1,\"\")","v":""},"6504","Sash Width",{"$f":"IF(TYPE=2,TRUNC(((Frame_Width/4)+1.4375)*16+0.5)/16,TRUNC(((Frame_Width/4)+0.625)*16+0.5)/16)","v":0.625}]
[{"$f":"IF(OR(ModelNo=\"6504\",ModelNo=\"6512\"),2,\"\")","v":""},"6504","Sash Height",{"$f":"Frame_Height-3.375","v":-3.375}]
[{"$f":"IF(OR(ModelNo=\"6504\",ModelNo=\"6512\"),3,\"\")","v":""},"6504","Operating Sash Roller Track Length",{"$f":"Frame_Width-12.375","v":-12.375}]
[{"$f":"IF(OR(ModelNo=\"6504\",ModelNo=\"6512\"),4,\"\")","v":""},"6504","Screen Roller Track Length",{"$f":"Frame_Width-3.0625","v":-3.0625}]
[{"$f":"IF(OR(ModelNo=\"6504\",ModelNo=\"6512\"),5,\"\")","v":""},"6504","Fixed Panel Support",{"$f":"TRUNC(((Frame_Width/4)-9.5625)*32+0.5)/32","v":-9.53125}]
[{"$f":"IF(OR(ModelNo=\"6504\",ModelNo=\"6512\"),6,\"\")","v":""},"6504","Glass Width",{"$f":"IF(TYPE=2,TRUNC(((Frame_Width/4)-7.4375)*16+0.5)/16,TRUNC(((Frame_Width/4)-4.75)*16+0.5)/16)","v":-4.6875}]
[{"$f":"IF(OR(ModelNo=\"6504\",ModelNo=\"6512\"),7,\"\")","v":""},"6504","Glass Height",{"$f":"IF(TYPE=1,TRUNC((Frame_Height-8.6875)*16+0.5)/16,IF(TYPE=2,TRUNC((Frame_Height-12.1875)*32+0.5)/32,IF(TYPE=3,TRUNC((Frame_Height-14.1875)*32+0.5)/32,\"\")))","v":-8.625}]
[{"$f":"IF(OR(ModelNo=\"6504\",ModelNo=\"6512\"),8,\"\")","v":""},"6504","Screen Width",{"$f":"TRUNC(((Frame_Width/4)+0.3125)*16+0.5)/16","v":0.3125}]
[{"$f":"IF(OR(ModelNo=\"6504\",ModelNo=\"6512\"),9,\"\")","v":""},"6504","Screen Height",{"$f":"Frame_Height-2.9375","v":-2.9375}]
[{"$f":"IF(OR(ModelNo=\"6504\",ModelNo=\"6512\"),10,\"\")","v":""},"6504","Egress Opening Width",{"$f":"TRUNC(((Frame_Width-(D536+4.375)*2)-2.1875)*16+0.5)/16","v":-12.125}]
[{"$f":"IF(OR(ModelNo=\"6504\",ModelNo=\"6512\"),11,\"\")","v":""},"6504","Egress Opening Height",{"$f":"Frame_Height-(2.25*2)","v":-4.5}]
[{"$f":"IF(OR(ModelNo=\"6504\",ModelNo=\"6512\"),12,\"\")","v":""},"6504","Egress Opening Area (sq.ft.)",{"$f":"(D546*D545)/144","v":0.37890625}]
[{"$f":"IF(ModelNo=B548,1,\"\")","v":""},"3A01","Top Sash Width",{"$f":"Frame_Width-4.125","v":-4.125}]
[{"$f":"IF(ModelNo=B549,2,\"\")","v":""},"3A01","Top Sash Height",{"$f":"DDIM3A01-1.625","v":-1.625}]
[{"$f":"IF(ModelNo=B550,3,\"\")","v":""},"3A01","Bottom Sash Width",{"$f":"Frame_Width-3.125","v":-3.125}]
[{"$f":"IF(ModelNo=B551,4,\"\")","v":""},"3A01","Bottom Sash Height",{"$f":"CDIM3A01-0.625","v":-0.625}]
[{"$f":"IF(ModelNo=B552,5,\"\")","v":""},"3A01","Top Glass Width",{"$f":"CMR!T13","v":-5.75}]
[{"$f":"IF(ModelNo=B553,6,\"\")","v":""},"3A01","Top Glass Height",{"$f":"CMR!T15","v":-3.21875}]
[{"$f":"IF(ModelNo=B554,7,\"\")","v":""},"3A01","Bottom Glass Width",{"$f":"CMR!T14","v":-4.75}]
[{"$f":"IF(ModelNo=B555,8,\"\")","v":""},"3A01","Bottom Glass Height",{"$f":"CMR!T16","v":-2.21875}]
[{"$f":"IF(ModelNo=B556,9,\"\")","v":""},"3A01","Screen Width",{"$f":"IF(Screen=\"H\",Frame_Width-4.5,Frame_Width-4.5625)","v":-4.5}]
[{"$f":"IF(ModelNo=B557,10,\"\")","v":""},"3A01","Screen Height",{"$f":"IF(Screen=\"L\",TRUNC((CDIM3A01-0.75)*16+0.5)/16,IF(Screen=\"F\",TRUNC((Frame_Height-3.3125)*16+0.5)/16,TRUNC((CDIM3A01-0.75)*16+0.5)/16))","v":-0.6875}]
[{"$f":"IF(ModelNo=B558,11,\"\")","v":""},"3A01","Top Sash Weight (Plus 5 lb)",{"$f":"IF(ISERROR(TOP_WGT&\" \"&\"lb\"),\"N/A\",TOP_WGT&\" \"&\"lb\")","v":"N/A"}]
[{"$f":"IF(ModelNo=B559,12,\"\")","v":""},"3A01","Top Balance Size (C.F)",{"$f":"IF(ISERROR((VLOOKUP(TOP_WGT,CFB,2,FALSE))&(VLOOKUP(TOP_WGT,CFB,3,FALSE))),\"N/A\",(VLOOKUP(TOP_WGT,CFB,2,FALSE))&(VLOOKUP(TOP_WGT,CFB,3,FALSE)))","v":"N/A"}]
[{"$f":"IF(ModelNo=B560,13,\"\")","v":""},"3A01","Bottom Sash Weight",{"$f":"IF(ISERROR(BTM_WGT&\" \"&\"lb\"),\"N/A\",BTM_WGT&\" \"&\"lb\")","v":"N/A"}]
[{"$f":"IF(ModelNo=B561,14,\"\")","v":""},"3A01","Bottom Balance Size (C.F)",{"$f":"IF(ISERROR((VLOOKUP(BTM_WGT,CFB,2,FALSE))&(VLOOKUP(BTM_WGT,CFB,3,FALSE))),\"N/A\",(VLOOKUP(BTM_WGT,CFB,2,FALSE))&(VLOOKUP(BTM_WGT,CFB,3,FALSE)))","v":"N/A"}]
[{"$f":"IF(ModelNo=B562,15,\"\")","v":""},"3A01","Egress Opening Width",{"$f":"IF(ISERROR(EW),\"N/A\",EW)","v":"N/A"}]
[{"$f":"IF(ModelNo=B563,16,\"\")","v":""},"3A01","Egress Opening Height",{"$f":"IF(ISERROR(EH),\"N/A\",EH)","v":"N/A"}]
[{"$f":"IF(ModelNo=B564,17,\"\")","v":""},"3A01","Egress Opening Area (sq.ft.)",{"$f":"IF(ISERROR(EO),\"N/A\",EO)","v":"N/A"}]
[{"$f":"IF(ModelNo=B565,1,\"\")","v":""},"3A02","Sash Width",{"$f":"(Frame_Width/2)-0.875","v":-0.875}]
[{"$f":"IF(ModelNo=B566,2,\"\")","v":""},"3A02","Sash Height",{"$f":"Frame_Height-3.8125","v":-3.8125}]
[{"$f":"IF(ModelNo=B567,3,\"\")","v":""},"3A02","Roller Track Length",{"$f":"Frame_Width-2.6875","v":-2.6875}]
[{"$f":"IF(ModelNo=B568,4,\"\")","v":""},"3A02","Glass Width",{"$f":"(Frame_Width/2)-2.5625","v":-2.5625}]
[{"$f":"IF(ModelNo=B569,5,\"\")","v":""},"3A02","Glass Height",{"$f":"Frame_Height-5.4375","v":-5.4375}]
[{"$f":"IF(ModelNo=B570,6,\"\")","v":""},"3A02","Screen Width",{"$f":"IF(Screen=\"F\",Frame_Width-5,IF(Screen=\"L\",\"N/A\",(Frame_Width/2)-2.4375))","v":-2.4375}]
[{"$f":"IF(ModelNo=B571,7,\"\")","v":""},"3A02","Screen Height",{"$f":"Frame_Height-4.5625","v":-4.5625}]
[{"$f":"IF(ModelNo=B572,8,\"\")","v":""},"3A02","Egress Opening Width",{"$f":"(Frame_Width/2)-4.75","v":-4.75}]
[{"$f":"IF(ModelNo=B573,9,\"\")","v":""},"3A02","Egress Opening Height",{"$f":"Frame_Height-5.25","v":-5.25}]
[{"$f":"IF(ModelNo=B574,10,\"\")","v":""},"3A02","Egress Opening Area (sq.ft.)",{"$f":"(D572*D573)/144","v":0.17317708333333334}]
[{"$f":"IF(ModelNo=B575,1,\"\")","v":""},"3A03","Operating Sash Width",{"$f":"TRUNC((((Frame_Width/4)+0.1875))*16+0.5)/16","v":0.1875}]
[{"$f":"IF(ModelNo=B576,2,\"\")","v":""},"3A03","Operating Sash Height",{"$f":"Frame_Height-3.8125","v":-3.8125}]
[{"$f":"IF(ModelNo=B577,3,\"\")","v":""},"3A03","Fixed Sash Width",{"$f":"(Frame_Width-(2*(TRUNC((((Frame_Width/4)+1))*16+0.5)/16)))+0.75","v":-1.25}]
[{"$f":"IF(ModelNo=B578,4,\"\")","v":""},"3A03","Fixed Sash Height",{"$f":"Frame_Height-3.8125","v":-3.8125}]
[{"$f":"IF(ModelNo=B579,5,\"\")","v":""},"3A03","Roller Track Length",{"$f":"Frame_Width-2.6875","v":-2.6875}]
[{"$f":"IF(ModelNo=B580,6,\"\")","v":""},"3A03","Operating Sash Glass Width",{"$f":"TRUNC(((TRUNC((((Frame_Width/4)+0.1875))*16+0.5)/16)-1.6875)*16+0.5)/16","v":-1.4375}]
[{"$f":"IF(ModelNo=B581,7,\"\")","v":""},"3A03","Operating Sash Glass Height",{"$f":"Frame_Height-5.4375","v":-5.4375}]
[{"$f":"IF(ModelNo=B582,8,\"\")","v":""},"3A03","Fixed Sash Glass Width",{"$f":"TRUNC((((Frame_Width-(2*(TRUNC((((Frame_Width/4)+1))*16+0.5)/16)))+0.75)-1.6875)*16+0.5)/16","v":-2.875}]
[{"$f":"IF(ModelNo=B583,9,\"\")","v":""},"3A03","Fixed Sash Glass Height",{"$f":"Frame_Height-5.4375","v":-5.4375}]
[{"$f":"IF(ModelNo=B584,10,\"\")","v":""},"3A03","Screen Width",{"$f":"IF(Screen=\"F\",Frame_Width-5,IF(Screen=\"L\",\"N/A\",TRUNC(((Frame_Width/4)-1.25)*16+0.5)/16))","v":-1.1875}]
[{"$f":"IF(ModelNo=B585,11,\"\")","v":""},"3A03","Screen Height",{"$f":"Frame_Height-4.5625","v":-4.5625}]
[{"$f":"IF(ModelNo=B586,12,\"\")","v":""},"3A03","Egress Opening Width",{"$f":"(Frame_Width/4)-2.25","v":-2.25}]
[{"$f":"IF(ModelNo=B587,13,\"\")","v":""},"3A03","Egress Opening Height",{"$f":"Frame_Height-5.25","v":-5.25}]
[{"$f":"IF(ModelNo=B588,14,\"\")","v":""},"3A03","Egress Opening Area (sq.ft.)",{"$f":"(D586*D587)/144","v":8.203125E-2}]
[{"$f":"IF(OR(ModelNo=\"3A04\",ModelNo=\"03S4\"),1,\"\")","v":""},"3004","Glass Width",{"$f":"Frame_Width-4.1875","v":-4.1875}]
[{"$f":"IF(OR(ModelNo=\"3A04\",ModelNo=\"03S4\"),2,\"\")","v":""},"3004","Glass Height",{"$f":"Frame_Height-4.1875","v":-4.1875}]
[{"$f":"IF(OR(ModelNo=\"3A04\",ModelNo=\"03S4\"),3,\"\")","v":""},"3004","Glass Area (sq.ft.)",{"$f":"(D589*D590)/144","v":0.12177191840277778}]
[{"$f":"IF(OR(ModelNo=\"3A04\",ModelNo=\"03S4\"),4,\"\")","v":""},"3004",{"$f":"IF(MAX_SHORT=1,\"Max Short Glass Must be Less Than \"&MAX_SG,\"\")","v":{"$error":"#N/A"}}]
[{"$f":"IF(ModelNo=B593,1,\"\")","v":""},"3A09","Operating Sash Width",{"$f":"TRUNC(((Frame_Width/3)-0.3125)*16+0.5)/16","v":-0.25}]
[{"$f":"IF(ModelNo=B594,2,\"\")","v":""},"3A09","Operating Sash Height",{"$f":"Frame_Height-3.8125","v":-3.8125}]
[{"$f":"IF(ModelNo=B595,3,\"\")","v":""},"3A09","Fixed Sash Width",{"$f":"TRUNC(((Frame_Width/3)-0.25)*16+0.5)/16","v":-0.1875}]
[{"$f":"IF(ModelNo=B596,4,\"\")","v":""},"3A09","Fixed Sash Height",{"$f":"Frame_Height-3.8125","v":-3.8125}]
[{"$f":"IF(ModelNo=B597,5,\"\")","v":""},"3A09","Roller Track Length",{"$f":"Frame_Width-2.6875","v":-2.6875}]
[{"$f":"IF(ModelNo=B598,6,\"\")","v":""},"3A09","Operating Sash Glass Width",{"$f":"TRUNC(((TRUNC(((Frame_Width/3)-0.3125)*16+0.5)/16)-1.6875)*16+0.5)/16","v":-1.875}]
[{"$f":"IF(ModelNo=B599,7,\"\")","v":""},"3A09","Operating Sash Glass Height",{"$f":"Frame_Height-5.4375","v":-5.4375}]
[{"$f":"IF(ModelNo=B600,8,\"\")","v":""},"3A09","Fixed Sash Glass Width",{"$f":"TRUNC(((TRUNC(((Frame_Width/3)-0.3125)*16+0.5)/16)-1.6875)*16+0.5)/16","v":-1.875}]
[{"$f":"IF(ModelNo=B601,9,\"\")","v":""},"3A09","Fixed Sash Glass Height",{"$f":"Frame_Height-5.4375","v":-5.4375}]
[{"$f":"IF(ModelNo=B602,10,\"\")","v":""},"3A09","Screen Width",{"$f":"IF(Screen=\"F\",Frame_Width-5,IF(Screen=\"L\",\"N/A\",TRUNC((Frame_Width/3-0.125)*16+0.5)/16-1.75))","v":-1.8125}]
[{"$f":"IF(ModelNo=B603,11,\"\")","v":""},"3A09","Screen Height",{"$f":"Frame_Height-4.5625","v":-4.5625}]
[{"$f":"IF(ModelNo=B604,12,\"\")","v":""},"3A09","Egress Opening Width",{"$f":"(Frame_Width/3)-4.375","v":-4.375}]
[{"$f":"IF(ModelNo=B605,13,\"\")","v":""},"3A09","Egress Opening Height",{"$f":"Frame_Height-5.25","v":-5.25}]
[{"$f":"IF(ModelNo=B606,14,\"\")","v":""},"3A09","Egress Opening Area (sq.ft.)",{"$f":"(D604*D605)/144","v":0.15950520833333334}]
[{"$f":"IF(ModelNo=B607,1,\"\")","v":""},"03S0","Bottom Sash Width",{"$f":"Frame_Width-3.125","v":-3.125}]
[{"$f":"IF(ModelNo=B608,2,\"\")","v":""},"03S0","Bottom Sash Height",{"$f":"CDIM03S0-1.125","v":-1.125}]
[{"$f":"IF(ModelNo=B609,3,\"\")","v":""},"03S0","Bottom Glass Width",{"$f":"CMR!T30","v":-4.75}]
[{"$f":"IF(ModelNo=B610,4,\"\")","v":""},"03S0","Bottom Glass Height",{"$f":"CMR!T32","v":-2.71875}]
[{"$f":"IF(ModelNo=B611,5,\"\")","v":""},"03S0","Top Glass Width",{"$f":"CMR!T29","v":-4.6875}]
[{"$f":"IF(ModelNo=B612,6,\"\")","v":""},"03S0","Top Glass Height",{"$f":"CMR!T31","v":-2.59375}]
[{"$f":"IF(ModelNo=B613,7,\"\")","v":""},"03S0","Astragal Length",{"$f":"TRUNC((Frame_Width-4.125)*16+0.5)/16","v":-4.0625}]
[{"$f":"IF(ModelNo=B614,8,\"\")","v":""},"03S0","Screen Width",{"$f":"Frame_Width-4.5","v":-4.5}]
[{"$f":"IF(ModelNo=B615,9,\"\")","v":""},"03S0","Screen Height",{"$f":"IF(Screen=\"F\",Frame_Height-3.3125,IF(Screen=\"L\",CDIM03S0-1.0625,CDIM03S0-1.3125))","v":-1.3125}]
[{"$f":"IF(ModelNo=B616,10,\"\")","v":""},"03S0","Bottom Sash Weight",{"$f":"IF(ISERROR(BTM_WGT&\" \"&\"lb\"),\"N/A\",BTM_WGT&\" \"&\"lb\")","v":"N/A"}]
[{"$f":"IF(ModelNo=B617,11,\"\")","v":""},"03S0","Balance Size",{"$f":"IF(ISERROR((VLOOKUP(BTM_WGT,CFB,2,FALSE))&(VLOOKUP(BTM_WGT,CFB,3,FALSE))),\"N/A\",(VLOOKUP(BTM_WGT,CFB,2,FALSE))&(VLOOKUP(BTM_WGT,CFB,3,FALSE)))","v":"N/A"}]
[{"$f":"IF(ModelNo=B618,12,\"\")","v":""},"03S0","Egress Opening Width",{"$f":"IF(ISERROR(EW),\"N/A\",EW)","v":"N/A"}]
[{"$f":"IF(ModelNo=B619,13,\"\")","v":""},"03S0","Egress Opening Height",{"$f":"IF(ISERROR(EH),\"N/A\",EH)","v":"N/A"}]
[{"$f":"IF(ModelNo=B620,14,\"\")","v":""},"03S0","Egress Opening Area (sq.ft.)",{"$f":"(D618*D619)/144","v":{"$error":"#VALUE!"}}]
[{"$f":"IF(ModelNo=B621,1,\"\")","v":""},"03S2","Sash Width",{"$f":"TRUNC(((Frame_Width/2)-1.0625)*16+0.5)/16","v":-1}]
[{"$f":"IF(ModelNo=B622,2,\"\")","v":""},"03S2","Sash Height",{"$f":"Frame_Height-3.0625","v":-3.0625}]
[{"$f":"IF(ModelNo=B623,3,\"\")","v":""},"03S2","Roller Track Length",{"$f":"Frame_Width-1.9375","v":-1.9375}]
[{"$f":"IF(ModelNo=B624,4,\"\")","v":""},"03S2","Sash Glass Width",{"$f":"TRUNC(((Frame_Width/2)-2.75)*16+0.5)/16","v":-2.6875}]
[{"$f":"IF(ModelNo=B625,5,\"\")","v":""},"03S2","Sash Glass Height",{"$f":"Frame_Height-4.6875","v":-4.6875}]
[{"$f":"IF(ModelNo=B626,6,\"\")","v":""},"03S2","Fixed Glass Width",{"$f":"TRUNC(((Frame_Width/2)-2.625)*16+0.5)/16","v":-2.5625}]
[{"$f":"IF(ModelNo=B627,7,\"\")","v":""},"03S2","Fixed Glass Height",{"$f":"TRUNC((Frame_Height-4.8125)*16+0.5)/16","v":-4.75}]
[{"$f":"IF(ModelNo=B628,8,\"\")","v":""},"03S2","Screen Width",{"$f":"IF(Screen=\"F\",Frame_Width-5,IF(Screen=\"L\",\"N/A\",TRUNC(((Frame_Width/2)-3.0625)*16+0.5)/16))","v":-3}]
[{"$f":"IF(ModelNo=B629,9,\"\")","v":""},"03S2","Screen Height",{"$f":"Frame_Height-4.5625","v":-4.5625}]
[{"$f":"IF(ModelNo=B630,10,\"\")","v":""},"03S2","Egress Opening Width",{"$f":"(Frame_Width/2)-4.75","v":-4.75}]
[{"$f":"IF(ModelNo=B631,11,\"\")","v":""},"03S2","Egress Opening Height",{"$f":"Frame_Height-5.875","v":-5.875}]
[{"$f":"IF(ModelNo=B632,12,\"\")","v":""},"03S2","Egress Opening Area (sq.ft.)",{"$f":"(D630*D631)/144","v":0.19379340277777779}]
[{"$f":"IF(ModelNo=B633,1,\"\")","v":""},"03S3","Operating Sash Width",{"$f":"TRUNC((((Frame_Width/4)+0.25))*16+0.5)/16","v":0.25}]
[{"$f":"IF(ModelNo=B634,2,\"\")","v":""},"03S3","Operating Sash Height",{"$f":"Frame_Height-3.0625","v":-3.0625}]
[{"$f":"IF(ModelNo=B635,3,\"\")","v":""},"03S3","Fixed Sash Width",{"$f":"(Frame_Width-(2*(TRUNC((((Frame_Width/4)+0.75))*16+0.5)/16)))+1.1875","v":-0.3125}]
[{"$f":"IF(ModelNo=B636,4,\"\")","v":""},"03S3","Fixed Sash Height",{"$f":"Frame_Height-3.125","v":-3.125}]
[{"$f":"IF(ModelNo=B637,5,\"\")","v":""},"03S3","Roller Track Length",{"$f":"Frame_Width-1.9375","v":-1.9375}]
[{"$f":"IF(ModelNo=B638,6,\"\")","v":""},"03S3","Operating Sash Glass Width",{"$f":"TRUNC(((TRUNC((((Frame_Width/4)+0.25))*16+0.5)/16)-1.6875)*16+0.5)/16","v":-1.375}]
[{"$f":"IF(ModelNo=B639,7,\"\")","v":""},"03S3","Operating Sash Glass Height",{"$f":"Frame_Height-4.6875","v":-4.6875}]
[{"$f":"IF(ModelNo=B640,8,\"\")","v":""},"03S3","Fixed Sash Glass Width",{"$f":"TRUNC((((Frame_Width-(2*(TRUNC((((Frame_Width/4)+0.6875))*16+0.5)/16)))+1)-2.75)*16+0.5)/16","v":-3.0625}]
[{"$f":"IF(ModelNo=B641,9,\"\")","v":""},"03S3","Fixed Sash Glass Height",{"$f":"Frame_Height-4.8125","v":-4.8125}]
[{"$f":"IF(ModelNo=B642,10,\"\")","v":""},"03S3","Screen Width",{"$f":"IF(Screen=\"F\",Frame_Width-5,IF(Screen=\"L\",\"N/A\",(TRUNC((Frame_Width/4+0.75)*16+0.5)/16)-2.5))","v":-1.75}]
[{"$f":"IF(ModelNo=B643,11,\"\")","v":""},"03S3","Screen Height",{"$f":"Frame_Height-4.5625","v":-4.5625}]
[{"$f":"IF(ModelNo=B644,12,\"\")","v":""},"03S3","Egress Opening Width",{"$f":"(Frame_Width/4)-2.875","v":-2.875}]
[{"$f":"IF(ModelNo=B645,13,\"\")","v":""},"03S3","Egress Opening Height",{"$f":"Frame_Height-5.875","v":-5.875}]
[{"$f":"IF(ModelNo=B646,14,\"\")","v":""},"03S3","Egress Opening Area (sq.ft.)",{"$f":"(D644*D645)/144","v":0.11729600694444445}]
[{"$f":"IF(ModelNo=B647,1,\"\")","v":""},"03S9","Operating Sash Width",{"$f":"TRUNC(((Frame_Width/3)-0.3125)*16+0.5)/16","v":-0.25}]
[{"$f":"IF(ModelNo=B648,2,\"\")","v":""},"03S9","Operating Sash Height",{"$f":"Frame_Height-3.0625","v":-3.0625}]
[{"$f":"IF(ModelNo=B649,3,\"\")","v":""},"03S9","Fixed Sash Width",{"$f":"(Frame_Width-((TRUNC((Frame_Width/3+0.25)*16+0.5)/16))*2)+1.1875","v":0.6875}]
[{"$f":"IF(ModelNo=B650,4,\"\")","v":""},"03S9","Fixed Sash Height",{"$f":"Frame_Height-3.125","v":-3.125}]
[{"$f":"IF(ModelNo=B651,5,\"\")","v":""},"03S9","Roller Track Length",{"$f":"Frame_Width-1.9375","v":-1.9375}]
[{"$f":"IF(ModelNo=B652,6,\"\")","v":""},"03S9","Operating Sash Glass Width",{"$f":"TRUNC(((TRUNC(((Frame_Width/3)-0.3125)*16+0.5)/16)-1.6875)*16+0.5)/16","v":-1.875}]
[{"$f":"IF(ModelNo=B653,7,\"\")","v":""},"03S9","Operating Sash Glass Height",{"$f":"Frame_Height-4.6875","v":-4.6875}]
[{"$f":"IF(ModelNo=B654,8,\"\")","v":""},"03S9","Fixed Sash Glass Width",{"$f":"((Frame_Width-((TRUNC(((Frame_Width/3)+0.1875)*16+0.5)/16)*2))+1.1875)-2.8125","v":-2}]
[{"$f":"IF(ModelNo=B655,9,\"\")","v":""},"03S9","Fixed Sash Glass Height",{"$f":"Frame_Height-4.8125","v":-4.8125}]
[{"$f":"IF(ModelNo=B656,10,\"\")","v":""},"03S9","Screen Width",{"$f":"IF(Screen=\"F\",Frame_Width-5,IF(Screen=\"L\",\"N/A\",(TRUNC((Frame_Width/3+0.1875)*16+0.5)/16)-2.5))","v":-2.3125}]
[{"$f":"IF(ModelNo=B657,11,\"\")","v":""},"03S9","Screen Height",{"$f":"Frame_Height-4.5625","v":-4.5625}]
[{"$f":"IF(ModelNo=B658,12,\"\")","v":""},"03S9","Egress Opening Width",{"$f":"(Frame_Width/3)-4.375","v":-4.375},{"$f":"IF(EXTSELECT=2,12.5,IF(EXTSELECT=3,13.5,0))","v":0}]
[{"$f":"IF(ModelNo=B659,13,\"\")","v":""},"03S9","Egress Opening Height",{"$f":"Frame_Height-5.875","v":-5.875}]
[{"$f":"IF(ModelNo=B660,14,\"\")","v":""},"03S9","Egress Opening Area (sq.ft.)",{"$f":"(D658*D659)/144","v":0.1784939236111111}]
[{"$f":"IF(OR(ModelNo=\"A140\",ModelNo=\"A144\",ModelNo=\"A146\"),1,\"\")","v":""},"A140","Frame Radius",{"$f":"IF(ModelNo=\"A146\",((Frame_Height-LEG)/2)+(((Frame_Width*2)^2)/(8*(Frame_Height-LEG))),((Frame_Height-LEG)/2)+((Frame_Width^2)/(8*(Frame_Height-LEG))))","v":{"$error":"#DIV/0!"}}]
[{"$f":"IF(OR(ModelNo=\"A140\",ModelNo=\"A144\",ModelNo=\"A146\"),2,\"\")","v":""},"A140","Bottom Sash Width",{"$f":"Frame_Width-3.125","v":-3.125}]
[{"$f":"IF(OR(ModelNo=\"A140\",ModelNo=\"A144\",ModelNo=\"A146\"),3,\"\")","v":""},"A140","Bottom Sash Height",{"$f":"CDIMA140-1.125","v":-1.125}]
[{"$f":"IF(OR(ModelNo=\"A140\",ModelNo=\"A144\",ModelNo=\"A146\"),4,\"\")","v":""},"A140","Bottom Glass Width",{"$f":"D662-1.6875","v":-4.8125}]
[{"$f":"IF(OR(ModelNo=\"A140\",ModelNo=\"A144\",ModelNo=\"A146\"),5,\"\")","v":""},"A140","Bottom Glass Height",{"$f":"D663-1.625","v":-2.75}]
[{"$f":"IF(OR(ModelNo=\"A140\",ModelNo=\"A144\",ModelNo=\"A146\"),6,\"\")","v":""},"A140","Top Glass Radius",{"$f":"CMR!N13","v":{"$error":"#DIV/0!"}}]
[{"$f":"IF(OR(ModelNo=\"A140\",ModelNo=\"A144\",ModelNo=\"A146\"),7,\"\")","v":""},"A140","Top Glass Width",{"$f":"CMR!L13","v":0}]
[{"$f":"IF(OR(ModelNo=\"A140\",ModelNo=\"A144\",ModelNo=\"A146\"),8,\"\")","v":""},"A140","Top Glass Height",{"$f":"CMR!L15","v":-0.26400000000000001}]
[{"$f":"IF(OR(ModelNo=\"A140\",ModelNo=\"A144\",ModelNo=\"A146\"),9,\"\")","v":""},"A140","Top Glass Leg Height",{"$f":"CMR!N16","v":{"$error":"#DIV/0!"}}]
[{"$f":"IF(OR(ModelNo=\"A140\",ModelNo=\"A144\",ModelNo=\"A146\"),10,\"\")","v":""},"A140","Astragal Length",{"$f":"TRUNC((Frame_Width-4.125)*16+0.5)/16","v":-4.0625}]
[{"$f":"IF(OR(ModelNo=\"A140\",ModelNo=\"A144\",ModelNo=\"A146\"),11,\"\")","v":""},"A140","Screen Width",{"$f":"Frame_Width-4.5","v":-4.5}]
[{"$f":"IF(OR(ModelNo=\"A140\",ModelNo=\"A144\",ModelNo=\"A146\"),12,\"\")","v":""},"A140","Screen Height",{"$f":"CDIMA140-1.3125","v":-1.3125}]
[{"$f":"IF(OR(ModelNo=\"A140\",ModelNo=\"A144\",ModelNo=\"A146\"),13,\"\")","v":""},"A140","Bottom Sash Weight",{"$f":"IF(ISERROR(BTM_WGT&\" \"&\"lb\"),\"N/A\",BTM_WGT&\" \"&\"lb\")","v":"N/A"}]
[{"$f":"IF(OR(ModelNo=\"A140\",ModelNo=\"A144\",ModelNo=\"A146\"),14,\"\")","v":""},"A140","Balance Size",{"$f":"IF(ISERROR((VLOOKUP(BTM_WGT,CFB,2,FALSE))&(VLOOKUP(BTM_WGT,CFB,3,FALSE))),\"N/A\",(VLOOKUP(BTM_WGT,CFB,2,FALSE))&(VLOOKUP(BTM_WGT,CFB,3,FALSE)))","v":"N/A"}]
[{"$f":"IF(OR(ModelNo=\"A140\",ModelNo=\"A144\",ModelNo=\"A146\"),15,\"\")","v":""},"A140","Egress Opening Width",{"$f":"IF(ISERROR(EW),\"N/A\",EW)","v":"N/A"}]
[{"$f":"IF(OR(ModelNo=\"A140\",ModelNo=\"A144\",ModelNo=\"A146\"),16,\"\")","v":""},"A140","Egress Opening Height",{"$f":"IF(ISERROR(EH),\"N/A\",EH)","v":"N/A"}]
[{"$f":"IF(OR(ModelNo=\"A140\",ModelNo=\"A144\",ModelNo=\"A146\"),17,\"\")","v":""},"A140","Egress Opening Area (sq.ft.)",{"$f":"IF(ISERROR(EO),\"N/A\",EO)","v":"N/A"}]
[{"$f":"IF(OR(ModelNo=\"A740\",ModelNo=\"A744\",ModelNo=\"A746\"),1,\"\")","v":""},"A740","Frame Radius",{"$f":"IF(ModelNo=\"A746\",((Frame_Height-LEG)/2)+(((Frame_Width*2)^2)/(8*(Frame_Height-LEG))),((Frame_Height-LEG)/2)+((Frame_Width^2)/(8*(Frame_Height-LEG))))","v":{"$error":"#DIV/0!"}}]
[{"$f":"IF(OR(ModelNo=\"A740\",ModelNo=\"A744\",ModelNo=\"A746\"),2,\"\")","v":""},"A740","Bottom Sash Width",{"$f":"Frame_Width-2.125","v":-2.125}]
[{"$f":"IF(OR(ModelNo=\"A740\",ModelNo=\"A744\",ModelNo=\"A746\"),3,\"\")","v":""},"A740","Bottom Sash Height",{"$f":"CDIMA740-0.875","v":-0.875}]
[{"$f":"IF(OR(ModelNo=\"A740\",ModelNo=\"A744\",ModelNo=\"A746\"),4,\"\")","v":""},"A740","Bottom Glass Width",{"$f":"D679-2.1875","v":-4.3125}]
[{"$f":"IF(OR(ModelNo=\"A740\",ModelNo=\"A744\",ModelNo=\"A746\"),5,\"\")","v":""},"A740","Bottom Glass Height",{"$f":"D680-2.1875","v":-3.0625}]
[{"$f":"IF(OR(ModelNo=\"A740\",ModelNo=\"A744\",ModelNo=\"A746\"),6,\"\")","v":""},"A740","Top Glass Radius",{"$f":"CMR!V45","v":{"$error":"#DIV/0!"}}]
[{"$f":"IF(OR(ModelNo=\"A740\",ModelNo=\"A744\",ModelNo=\"A746\"),7,\"\")","v":""},"A740","Top Glass Width",{"$f":"CMR!T45","v":0}]
[{"$f":"IF(OR(ModelNo=\"A740\",ModelNo=\"A744\",ModelNo=\"A746\"),8,\"\")","v":""},"A740","Top Glass Height",{"$f":"CMR!T47","v":-0.6875}]
[{"$f":"IF(OR(ModelNo=\"A740\",ModelNo=\"A744\",ModelNo=\"A746\"),9,\"\")","v":""},"A740","Top Glass Leg Height",{"$f":"CMR!V48","v":{"$error":"#DIV/0!"}}]
[{"$f":"IF(OR(ModelNo=\"A740\",ModelNo=\"A744\",ModelNo=\"A746\"),10,\"\")","v":""},"A740","Astragal Length",{"$f":"Frame_Width-1.8125","v":-1.8125}]
[{"$f":"IF(OR(ModelNo=\"A740\",ModelNo=\"A744\",ModelNo=\"A746\"),11,\"\")","v":""},"A740","Screen Width",{"$f":"Frame_Width-2.125","v":-2.125}]
[{"$f":"IF(OR(ModelNo=\"A740\",ModelNo=\"A744\",ModelNo=\"A746\"),12,\"\")","v":""},"A740","Screen Height",{"$f":"CDIMA740-1.8125","v":-1.8125}]
[{"$f":"IF(OR(ModelNo=\"A740\",ModelNo=\"A744\",ModelNo=\"A746\"),13,\"\")","v":""},"A740","Bottom Sash Weight",{"$f":"IF(ISERROR(BTM_WGT&\" \"&\"lb\"),\"N/A\",BTM_WGT&\" \"&\"lb\")","v":"N/A"}]
[{"$f":"IF(OR(ModelNo=\"A740\",ModelNo=\"A744\",ModelNo=\"A746\"),14,\"\")","v":""},"A740","Balance Size",{"$f":"IF(ISERROR((VLOOKUP(BTM_WGT,CFB,2,FALSE))&(VLOOKUP(BTM_WGT,CFB,3,FALSE))),\"N/A\",(VLOOKUP(BTM_WGT,CFB,2,FALSE))&(VLOOKUP(BTM_WGT,CFB,3,FALSE)))","v":"N/A"}]
[{"$f":"IF(OR(ModelNo=\"A740\",ModelNo=\"A744\",ModelNo=\"A746\"),15,\"\")","v":""},"A740","Egress Opening Width",{"$f":"IF(ISERROR(EW),\"N/A\",EW)","v":"N/A"}]
[{"$f":"IF(OR(ModelNo=\"A740\",ModelNo=\"A744\",ModelNo=\"A746\"),16,\"\")","v":""},"A740","Egress Opening Height",{"$f":"IF(ISERROR(EH),\"N/A\",EH)","v":"N/A"}]
[{"$f":"IF(OR(ModelNo=\"A740\",ModelNo=\"A744\",ModelNo=\"A746\"),17,\"\")","v":""},"A740","Egress Opening Area (sq.ft.)",{"$f":"IF(ISERROR(EO),\"N/A\",EO)","v":"N/A"}]
[{"$f":"IF(OR(ModelNo=\"A840\",ModelNo=\"A844\",ModelNo=\"A846\"),1,\"\")","v":""},"A840","Frame Radius",{"$f":"IF(ModelNo=\"A846\",((Frame_Height-LEG)/2)+(((Frame_Width*2)^2)/(8*(Frame_Height-LEG))),((Frame_Height-LEG)/2)+((Frame_Width^2)/(8*(Frame_Height-LEG))))","v":{"$error":"#DIV/0!"}}]
[{"$f":"IF(OR(ModelNo=\"A840\",ModelNo=\"A844\",ModelNo=\"A846\"),2,\"\")","v":""},"A840","Bottom Sash Width",{"$f":"Frame_Width-2.8125","v":-2.8125}]
[{"$f":"IF(OR(ModelNo=\"A840\",ModelNo=\"A844\",ModelNo=\"A846\"),3,\"\")","v":""},"A840","Bottom Sash Height",{"$f":"CDIMA840-1.5","v":-1.5}]
[{"$f":"IF(OR(ModelNo=\"A840\",ModelNo=\"A844\",ModelNo=\"A846\"),4,\"\")","v":""},"A840","Bottom Glass Width",{"$f":"D696-2.5625","v":-5.375}]
[{"$f":"IF(OR(ModelNo=\"A840\",ModelNo=\"A844\",ModelNo=\"A846\"),5,\"\")","v":""},"A840","Bottom Glass Height",{"$f":"D697-2.5625","v":-4.0625}]
[{"$f":"IF(OR(ModelNo=\"A840\",ModelNo=\"A844\",ModelNo=\"A846\"),6,\"\")","v":""},"A840","Top Glass Radius",{"$f":"CMR!V61","v":{"$error":"#DIV/0!"}}]
[{"$f":"IF(OR(ModelNo=\"A840\",ModelNo=\"A844\",ModelNo=\"A846\"),7,\"\")","v":""},"A840","Top Glass Width",{"$f":"CMR!T61","v":0}]
[{"$f":"IF(OR(ModelNo=\"A840\",ModelNo=\"A844\",ModelNo=\"A846\"),8,\"\")","v":""},"A840","Top Glass Height",{"$f":"CMR!T63","v":-0.71899999999999997}]
[{"$f":"IF(OR(ModelNo=\"A840\",ModelNo=\"A844\",ModelNo=\"A846\"),9,\"\")","v":""},"A840","Top Glass Leg Height",{"$f":"CMR!V64","v":{"$error":"#DIV/0!"}}]
[{"$f":"IF(OR(ModelNo=\"A840\",ModelNo=\"A844\",ModelNo=\"A846\"),10,\"\")","v":""},"A840","Astragal Length",{"$f":"Frame_Width-2.0625","v":-2.0625}]
[{"$f":"IF(OR(ModelNo=\"A840\",ModelNo=\"A844\",ModelNo=\"A846\"),11,\"\")","v":""},"A840","Screen Width",{"$f":"Frame_Width-2.375","v":-2.375}]
[{"$f":"IF(OR(ModelNo=\"A840\",ModelNo=\"A844\",ModelNo=\"A846\"),12,\"\")","v":""},"A840","Screen Height",{"$f":"CDIMA840-2","v":-2}]
[{"$f":"IF(OR(ModelNo=\"A840\",ModelNo=\"A844\",ModelNo=\"A846\"),13,\"\")","v":""},"A840","Bottom Sash Weight",{"$f":"IF(ISERROR(BTM_WGT&\" \"&\"lb\"),\"N/A\",BTM_WGT&\" \"&\"lb\")","v":"N/A"}]
[{"$f":"IF(OR(ModelNo=\"A840\",ModelNo=\"A844\",ModelNo=\"A846\"),14,\"\")","v":""},"A840","Balance Size",{"$f":"IF(ISERROR((VLOOKUP(BTM_WGT,CFB,2,FALSE))&(VLOOKUP(BTM_WGT,CFB,3,FALSE))),\"N/A\",(VLOOKUP(BTM_WGT,CFB,2,FALSE))&(VLOOKUP(BTM_WGT,CFB,3,FALSE)))","v":"N/A"}]
[{"$f":"IF(OR(ModelNo=\"A840\",ModelNo=\"A844\",ModelNo=\"A846\"),15,\"\")","v":""},"A840","Egress Opening Width",{"$f":"IF(ISERROR(EW),\"N/A\",EW)","v":"N/A"}]
[{"$f":"IF(OR(ModelNo=\"A840\",ModelNo=\"A844\",ModelNo=\"A846\"),16,\"\")","v":""},"A840","Egress Opening Height",{"$f":"IF(ISERROR(EH),\"N/A\",EH)","v":"N/A"}]
[{"$f":"IF(OR(ModelNo=\"A840\",ModelNo=\"A844\",ModelNo=\"A846\"),17,\"\")","v":""},"A840","Egress Opening Area (sq.ft.)",{"$f":"IF(ISERROR(EO),\"N/A\",EO)","v":"N/A"}]
[{"$f":"IF(ModelNo=B712,1,\"\")","v":""},"72HP","Bottom Glass Width",{"$f":"Frame_Width-2.3125","v":-2.3125}]
[{"$f":"IF(ModelNo=B713,2,\"\")","v":""},"72HP","Bottom Glass Height",{"$f":"IF(TYPE=1,(Frame_Height/2)-Offset,CMR-Offset)","v":0}]
[{"$f":"IF(ModelNo=B714,3,\"\")","v":""},"72HP","Top Glass Width",{"$f":"Frame_Width-2.3125","v":-2.3125}]
[{"$f":"IF(ModelNo=B715,4,\"\")","v":""},"72HP","Top Glass Height",{"$f":"IF(TYPE=1,(Frame_Height/2)-Offset,Frame_Height-CMR-Offset)","v":0}]
[{"$f":"IF(ModelNo=B716,1,\"\")","v":""},"72WP","Left Glass Width",{"$f":"IF(TYPE=1,(Frame_Width/2)-Offset,CMR-Offset)","v":0}]
[{"$f":"IF(ModelNo=B717,2,\"\")","v":""},"72WP","Left Glas Height",{"$f":"Frame_Height-2.3125","v":-2.3125}]
[{"$f":"IF(ModelNo=B718,3,\"\")","v":""},"72WP","Right Glass Width",{"$f":"IF(TYPE=1,(Frame_Width/2)-Offset,Frame_Width-CMR-Offset)","v":0}]
[{"$f":"IF(ModelNo=B719,4,\"\")","v":""},"72WP","Right Glass Height",{"$f":"Frame_Height-2.3125","v":-2.3125}]
[{"$f":"IF(ModelNo=B720,1,\"\")","v":""},"82HP","Bottom Glass Width",{"$f":"Frame_Width-2.5625","v":-2.5625}]
[{"$f":"IF(ModelNo=B721,2,\"\")","v":""},"82HP","Bottom Glass Height",{"$f":"IF(TYPE=1,(Frame_Height/2)-Offset,CMR-Offset)","v":0}]
[{"$f":"IF(ModelNo=B722,3,\"\")","v":""},"82HP","Top Glass Width",{"$f":"Frame_Width-2.5625","v":-2.5625}]
[{"$f":"IF(ModelNo=B723,4,\"\")","v":""},"82HP","Top Glass Height",{"$f":"IF(TYPE=1,(Frame_Height/2)-Offset,Frame_Height-CMR-Offset)","v":0}]
[{"$f":"IF(ModelNo=B724,1,\"\")","v":""},"82WP","Left Glass Width",{"$f":"IF(TYPE=1,(Frame_Width/2)-Offset,CMR-Offset)","v":0}]
[{"$f":"IF(ModelNo=B725,2,\"\")","v":""},"82WP","Left Glas Height",{"$f":"Frame_Height-2.5625","v":-2.5625}]
[{"$f":"IF(ModelNo=B726,3,\"\")","v":""},"82WP","Right Glass Width",{"$f":"IF(TYPE=1,(Frame_Width/2)-Offset,Frame_Width-CMR-Offset)","v":0}]
[{"$f":"IF(ModelNo=B727,4,\"\")","v":""},"82WP","Right Glass Height",{"$f":"Frame_Height-2.5625","v":-2.5625}]
[{"$f":"IF(ModelNo=B728,1,\"\")","v":""},"73HP","Top & Bottom Glass Width",{"$f":"Frame_Width-2.3125","v":-2.3125}]
[{"$f":"IF(ModelNo=B729,2,\"\")","v":""},"73HP","Top & Bottom Glass Height",{"$f":"TRUNC((CDIM73HP-Offset+TRIPLEHUNG)*16+0.5)/16","v":0}]
[{"$f":"IF(ModelNo=B730,3,\"\")","v":""},"73HP","Center Glass Width",{"$f":"Frame_Width-2.3125","v":-2.3125}]
[{"$f":"IF(ModelNo=B731,4,\"\")","v":""},"73HP","Center Glass Height",{"$f":"TRUNC((Frame_Height-(CDIM73HP*2)-Offset+(TRIPLEHUNG*2))*16+0.5)/16","v":0}]
[{"$f":"IF(ModelNo=B732,1,\"\")","v":""},"73WP","Left & Right Glass Width",{"$f":"TRUNC((CDIM73WP-Offset+TRIPLEHUNG)*16+0.5)/16","v":0}]
[{"$f":"IF(ModelNo=B733,2,\"\")","v":""},"73WP","Left & Right Glass Height",{"$f":"Frame_Height-2.3125","v":-2.3125}]
[{"$f":"IF(ModelNo=B734,3,\"\")","v":""},"73WP","Center Glass Width",{"$f":"TRUNC((Frame_Width-(CDIM73WP*2)-Offset+(TRIPLEHUNG*2))*16+0.5)/16","v":0}]
[{"$f":"IF(ModelNo=B735,4,\"\")","v":""},"73WP","Center Glass Height",{"$f":"Frame_Height-2.3125","v":-2.3125}]
[{"$f":"IF(ModelNo=B736,1,\"\")","v":""},"83HP","Top & Bottom Glass Width",{"$f":"Frame_Width-2.5625","v":-2.5625}]
[{"$f":"IF(ModelNo=B737,2,\"\")","v":""},"83HP","Top & Bottom Glass Height",{"$f":"TRUNC((CDIM83HP-Offset+TRIPLEHUNG)*16+0.5)/16","v":0}]
[{"$f":"IF(ModelNo=B738,3,\"\")","v":""},"83HP","Center Glass Width",{"$f":"Frame_Width-2.5625","v":-2.5625}]
[{"$f":"IF(ModelNo=B739,4,\"\")","v":""},"83HP","Center Glass Height",{"$f":"TRUNC((Frame_Height-(CDIM83HP*2)-Offset+(TRIPLEHUNG*2))*16+0.5)/16","v":0}]
[{"$f":"IF(ModelNo=B740,1,\"\")","v":""},"83WP","Left & Right Glass Width",{"$f":"TRUNC((CDIM83WP-Offset+TRIPLEHUNG)*16+0.5)/16","v":0}]
[{"$f":"IF(ModelNo=B741,2,\"\")","v":""},"83WP","Left & Right Glass Height",{"$f":"Frame_Height-2.5625","v":-2.5625}]
[{"$f":"IF(ModelNo=B742,3,\"\")","v":""},"83WP","Center Glass Width",{"$f":"TRUNC((Frame_Width-(CDIM83WP*2)-Offset+(TRIPLEHUNG*2))*16+0.5)/16","v":0}]
[{"$f":"IF(ModelNo=B743,4,\"\")","v":""},"83WP","Center Glass Height",{"$f":"Frame_Height-2.5625","v":-2.5625}]
[{"$f":"IF(ModelNo=B744,1,\"\")","v":""},"7SH2","Bottom Sash Width",{"$f":"TRUNC((Frame_Width/2+0.25-2.0625)*32+0.5)/32","v":-1.78125}]
[{"$f":"IF(ModelNo=B745,2,\"\")","v":""},"7SH2","Bottom Sash Height",{"$f":"CDIM7SH2-0.875","v":-0.875}]
[{"$f":"IF(ModelNo=B746,3,\"\")","v":""},"7SH2","Bottom Glass Width",{"$f":"D744-2.1875","v":-3.96875}]
[{"$f":"IF(ModelNo=B747,4,\"\")","v":""},"7SH2","Bottom Glass Height",{"$f":"D745-2.1875","v":-3.0625}]
[{"$f":"IF(ModelNo=B748,5,\"\")","v":""},"7SH2","Top Glass Width",{"$f":"TRUNC((Frame_Width/2+0.25-2.25)*32+0.5)/32","v":-1.96875}]
[{"$f":"IF(ModelNo=B749,6,\"\")","v":""},"7SH2","Top Glass Height",{"$f":"DDIM7SH2-1.8125","v":-1.8125}]
[{"$f":"IF(ModelNo=B750,7,\"\")","v":""},"7SH2","Astragal Length",{"$f":"TRUNC((Frame_Width/2-1.5)*32+0.5)/32","v":-1.46875}]
[{"$f":"IF(ModelNo=B751,8,\"\")","v":""},"7SH2","Screen Width",{"$f":"TRUNC((Frame_Width/2+0.25-2.0625)*32+0.5)/32","v":-1.78125}]
[{"$f":"IF(ModelNo=B752,9,\"\")","v":""},"7SH2","Screen Height",{"$f":"CDIM7SH2-1.8125","v":-1.8125}]
[{"$f":"IF(ModelNo=B753,10,\"\")","v":""},"7SH2","Bottom Sash Weight",{"$f":"IF(ISERROR(BTM_WGT&\" \"&\"lb\"),\"N/A\",BTM_WGT&\" \"&\"lb\")","v":"N/A"}]
[{"$f":"IF(ModelNo=B754,11,\"\")","v":""},"7SH2","Balance Size (B&T)",{"$f":"IF(ISERROR(BTM_TUBE),\"N/A\",BTM_TUBE)","v":"N/A"}]
[{"$f":"IF(ModelNo=B755,12,\"\")","v":""},"7SH2","Egress Opening Width",{"$f":"IF(ISERROR(EW),\"N/A\",EW)","v":"N/A"}]
[{"$f":"IF(ModelNo=B756,13,\"\")","v":""},"7SH2","Egress Opening Height",{"$f":"IF(ISERROR(EH),\"N/A\",EH)","v":"N/A"}]
[{"$f":"IF(ModelNo=B757,14,\"\")","v":""},"7SH2","Egress Opening Area (sq.ft.)",{"$f":"IF(ISERROR(EO),\"N/A\",EO)","v":"N/A"}]
[{"$f":"IF(ModelNo=B758,1,\"\")","v":""},"7SH3","Bottom Sash Width",{"$f":"TRUNC((((Frame_Width+0.5)-5.6875)/3)*32)/32","v":-1.71875}]
[{"$f":"IF(ModelNo=B759,2,\"\")","v":""},"7SH3","Bottom Sash Height",{"$f":"CDIM7SH3-0.875","v":-0.875}]
[{"$f":"IF(ModelNo=B760,3,\"\")","v":""},"7SH3","Bottom Glass Width",{"$f":"D758-2.1875","v":-3.90625}]
[{"$f":"IF(ModelNo=B761,4,\"\")","v":""},"7SH3","Bottom Glass Height",{"$f":"D759-2.1875","v":-3.0625}]
[{"$f":"IF(ModelNo=B762,5,\"\")","v":""},"7SH3","Top Glass Width",{"$f":"TRUNC((((Frame_Width+0.5)-6.25)/3)*32+0.5)/32","v":-1.875}]
[{"$f":"IF(ModelNo=B763,6,\"\")","v":""},"7SH3","Top Glass Height",{"$f":"DDIM7SH3-1.8125","v":-1.8125}]
[{"$f":"IF(ModelNo=B764,7,\"\")","v":""},"7SH3","Astragal Length",{"$f":"INT((((Frame_Width+0.5)-4.875)/3)*32+0.5)/32","v":-1.46875}]
[{"$f":"IF(ModelNo=B765,8,\"\")","v":""},"7SH3","Screen Width",{"$f":"TRUNC((((Frame_Width+0.5)-5.625)/3)*32+0.5)/32","v":-1.6875}]
[{"$f":"IF(ModelNo=B766,9,\"\")","v":""},"7SH3","Screen Height",{"$f":"CDIM7SH3-1.8125","v":-1.8125}]
[{"$f":"IF(ModelNo=B767,10,\"\")","v":""},"7SH3","Bottom Sash Weight",{"$f":"IF(ISERROR(BTM_WGT&\" \"&\"lb\"),\"N/A\",BTM_WGT&\" \"&\"lb\")","v":"N/A"}]
[{"$f":"IF(ModelNo=B768,11,\"\")","v":""},"7SH3","Balance Size (B&T)",{"$f":"IF(ISERROR(BTM_TUBE),\"N/A\",BTM_TUBE)","v":"N/A"}]
[{"$f":"IF(ModelNo=B769,12,\"\")","v":""},"7SH3","Egress Opening Width",{"$f":"IF(ISERROR(EW),\"N/A\",EW)","v":"N/A"}]
[{"$f":"IF(ModelNo=B770,13,\"\")","v":""},"7SH3","Egress Opening Height",{"$f":"IF(ISERROR(EH),\"N/A\",EH)","v":"N/A"}]
[{"$f":"IF(ModelNo=B771,14,\"\")","v":""},"7SH3","Egress Opening Area (sq.ft.)",{"$f":"IF(ISERROR(EO),\"N/A\",EO)","v":"N/A"}]
[{"$f":"IF(ModelNo=B772,1,\"\")","v":""},"8SH2","Bottom Sash Width",{"$f":"TRUNC((Frame_Width/2-2.3125)*32+0.5)/32","v":-2.28125}]
[{"$f":"IF(ModelNo=B773,2,\"\")","v":""},"8SH2","Bottom Sash Height",{"$f":"CDIM8SH2-1.5","v":-1.5}]
[{"$f":"IF(ModelNo=B774,3,\"\")","v":""},"8SH2","Bottom Glass Width",{"$f":"D772-2.5625","v":-4.84375}]
[{"$f":"IF(ModelNo=B775,4,\"\")","v":""},"8SH2","Bottom Glass Height",{"$f":"D773-2.5","v":-4}]
[{"$f":"IF(ModelNo=B776,5,\"\")","v":""},"8SH2","Top Glass Width",{"$f":"TRUNC((Frame_Width/2-2.125)*32+0.5)/32","v":-2.09375}]
[{"$f":"IF(ModelNo=B777,6,\"\")","v":""},"8SH2","Top Glass Height",{"$f":"DDIM8SH2-2","v":-2}]
[{"$f":"IF(ModelNo=B778,7,\"\")","v":""},"8SH2","Astragal Length",{"$f":"TRUNC((Frame_Width/2-1.625)*32+0.5)/32","v":-1.59375}]
[{"$f":"IF(ModelNo=B779,8,\"\")","v":""},"8SH2","Screen Width",{"$f":"TRUNC((Frame_Width/2+0.25-2.1875)*32+0.5)/32","v":-1.90625}]
[{"$f":"IF(ModelNo=B780,9,\"\")","v":""},"8SH2","Screen Height",{"$f":"CDIM8SH2-1.9375","v":-1.9375}]
[{"$f":"IF(ModelNo=B781,10,\"\")","v":""},"8SH2","Bottom Sash Weight",{"$f":"IF(ISERROR(BTM_WGT&\" \"&\"lb\"),\"N/A\",BTM_WGT&\" \"&\"lb\")","v":"N/A"}]
[{"$f":"IF(ModelNo=B782,11,\"\")","v":""},"8SH2","Balance Size (B&T)",{"$f":"IF(ISERROR(BTM_TUBE),\"N/A\",BTM_TUBE)","v":"N/A"}]
[{"$f":"IF(ModelNo=B783,12,\"\")","v":""},"8SH2","Egress Opening Width",{"$f":"IF(ISERROR(EW),\"N/A\",EW)","v":"N/A"}]
[{"$f":"IF(ModelNo=B784,13,\"\")","v":""},"8SH2","Egress Opening Height",{"$f":"IF(ISERROR(EH),\"N/A\",EH)","v":"N/A"}]
[{"$f":"IF(ModelNo=B785,14,\"\")","v":""},"8SH2","Egress Opening Area (sq.ft.)",{"$f":"IF(ISERROR(EO),\"N/A\",EO)","v":"N/A"}]
[{"$f":"IF(ModelNo=B786,1,\"\")","v":""},"8SH3","Bottom Sash Width",{"$f":"TRUNC(((Frame_Width/3)-2.779875+0.57)*32+0.5)/32","v":-2.1875}]
[{"$f":"IF(ModelNo=B787,2,\"\")","v":""},"8SH3","Bottom Sash Height",{"$f":"CDIM8SH3-1.5","v":-1.5}]
[{"$f":"IF(ModelNo=B788,3,\"\")","v":""},"8SH3","Bottom Glass Width",{"$f":"D786-2.5","v":-4.6875}]
[{"$f":"IF(ModelNo=B789,4,\"\")","v":""},"8SH3","Bottom Glass Height",{"$f":"D787-2.5","v":-4}]
[{"$f":"IF(ModelNo=B790,5,\"\")","v":""},"8SH3","Top Glass Width",{"$f":"TRUNC(((Frame_Width/3)-2.03125)*32+0.5)/32","v":-2}]
[{"$f":"IF(ModelNo=B791,6,\"\")","v":""},"8SH3","Top Glass Height",{"$f":"DDIM8SH3-2","v":-2}]
[{"$f":"IF(ModelNo=B792,7,\"\")","v":""},"8SH3","Astragal Length",{"$f":"TRUNC(((Frame_Width/3)-1.5)*32+0.5)/32","v":-1.46875}]
[{"$f":"IF(ModelNo=B793,8,\"\")","v":""},"8SH3","Screen Width",{"$f":"TRUNC(((Frame_Width/3)-2.375+0.57)*32+0.5)/32","v":-1.78125}]
[{"$f":"IF(ModelNo=B794,9,\"\")","v":""},"8SH3","Screen Height",{"$f":"CDIM8SH3-1.9375","v":-1.9375}]
[{"$f":"IF(ModelNo=B795,10,\"\")","v":""},"8SH3","Bottom Sash Weight",{"$f":"IF(ISERROR(BTM_WGT&\" \"&\"lb\"),\"N/A\",BTM_WGT&\" \"&\"lb\")","v":"N/A"}]
[{"$f":"IF(ModelNo=B796,11,\"\")","v":""},"8SH3","Balance Size (B&T)",{"$f":"IF(ISERROR(BTM_TUBE),\"N/A\",BTM_TUBE)","v":"N/A"}]
[{"$f":"IF(ModelNo=B797,12,\"\")","v":""},"8SH3","Egress Opening Width",{"$f":"IF(ISERROR(EW),\"N/A\",EW)","v":"N/A"}]
[{"$f":"IF(ModelNo=B798,13,\"\")","v":""},"8SH3","Egress Opening Height",{"$f":"IF(ISERROR(EH),\"N/A\",EH)","v":"N/A"}]
[{"$f":"IF(ModelNo=B799,14,\"\")","v":""},"8SH3","Egress Opening Area (sq.ft.)",{"$f":"IF(ISERROR(EO),\"N/A\",EO)","v":"N/A"}]
[{"$f":"IF(ModelNo=B800,1,\"\")","v":""},"82SP","Sash Width",{"$f":"IF(EXTSELECT=3,TRUNC((Frame_Width-_DIM4-2.375)*16+0.5)/16,TRUNC((_DIM4-2.375)*16+0.5)/16)","v":-2.3125}]
[{"$f":"IF(ModelNo=B801,2,\"\")","v":""},"82SP","Sash Height",{"$f":"TRUNC((CDIM82SP-1.75)*16+0.5)/16","v":-1.4375}]
[{"$f":"IF(ModelNo=B802,3,\"\")","v":""},"82SP","Sash Glass Width",{"$f":"TRUNC((D800-2.5625)*16+0.5)/16","v":-4.8125}]
[{"$f":"IF(ModelNo=B803,4,\"\")","v":""},"82SP","Sash Glass Height",{"$f":"TRUNC((D801-2.5625)*16+0.5)/16","v":-3.9375}]
[{"$f":"IF(ModelNo=B804,5,\"\")","v":""},"82SP","Fixed Glass Width",{"$f":"IF(EXTSELECT=3,TRUNC((Frame_Width-_DIM4-2.0625)*16+0.5)/16,TRUNC((_DIM4-2.0625)*16+0.5)/16)","v":-2}]
[{"$f":"IF(ModelNo=B805,6,\"\")","v":""},"82SP","Fixed Glass Height",{"$f":"TRUNC((Frame_Height-CDIM82SP-1.75)*16+0.5)/16","v":-1.9375}]
[{"$f":"IF(ModelNo=B806,7,\"\")","v":""},"82SP","Picture Window Glass Width",{"$f":"IF(EXTSELECT=3,_DIM4-2.125,Frame_Width-_DIM4-2.125)","v":-2.125}]
[{"$f":"IF(ModelNo=B807,8,\"\")","v":""},"82SP","Picture Window Glass Height",{"$f":"TRUNC((Frame_Height-2.5625)*16+0.5)/16","v":-2.5}]
[{"$f":"IF(ModelNo=B808,9,\"\")","v":""},"82SP","Astragal Length",{"$f":"MROUND((_DIM4-1.625 )+0.40625,0.0625)","v":{"$error":"#NUM!"}}]
[{"$f":"IF(ModelNo=B809,10,\"\")","v":""},"82SP","Screen Width",{"$f":"D800+0.4375","v":-1.875}]
[{"$f":"IF(ModelNo=B810,11,\"\")","v":""},"82SP","Screen Height",{"$f":"TRUNC((CDIM82SP-2.1875)*16+0.5)/16","v":-1.875}]
[{"$f":"IF(ModelNo=B811,12,\"\")","v":""},"82SP","Bottom Sash Weight",{"$f":"IF(ISERROR(BTM_WGT&\" \"&\"lb\"),\"N/A\",BTM_WGT&\" \"&\"lb\")","v":"N/A"}]
[{"$f":"IF(ModelNo=B812,13,\"\")","v":""},"82SP","Balance Size (B&T)",{"$f":"IF(ISERROR(BTM_TUBE),\"N/A\",BTM_TUBE)","v":"N/A"}]
[{"$f":"IF(ModelNo=B813,14,\"\")","v":""},"82SP","Egress Opening Width",{"$f":"IF(ISERROR(EW),\"N/A\",EW)","v":"N/A"}]
[{"$f":"IF(ModelNo=B814,15,\"\")","v":""},"82SP","Egress Opening Height",{"$f":"IF(ISERROR(EH),\"N/A\",EH)","v":"N/A"}]
[{"$f":"IF(ModelNo=B815,16,\"\")","v":""},"82SP","Egress Opening Area (sq.ft.)",{"$f":"IF(ISERROR(EO),\"N/A\",EO)","v":"N/A"}]
[{"$f":"IF(ModelNo=B816,1,\"\")","v":""},"8SPS","Sash Width",{"$f":"TRUNC((_DIM4-2.375)*16+0.5)/16","v":-2.3125}]
[{"$f":"IF(ModelNo=B817,2,\"\")","v":""},"8SPS","Sash Height",{"$f":"TRUNC((CDIM8SPS-1.75)*16+0.5)/16","v":-1.4375}]
[{"$f":"IF(ModelNo=B818,3,\"\")","v":""},"8SPS","Sash Glass Width",{"$f":"TRUNC((D816-2.5625)*16+0.5)/16","v":-4.8125}]
[{"$f":"IF(ModelNo=B819,4,\"\")","v":""},"8SPS","Sash Glass Height",{"$f":"TRUNC((D817-2.5625)*16+0.5)/16","v":-3.9375}]
[{"$f":"IF(ModelNo=B820,5,\"\")","v":""},"8SPS","Fixed Glass Width",{"$f":"TRUNC((_DIM4-2.125)*16+0.5)/16","v":-2.0625}]
[{"$f":"IF(ModelNo=B821,6,\"\")","v":""},"8SPS","Fixed Glass Height",{"$f":"TRUNC((Frame_Height-CDIM8SPS-1.75)*16+0.5)/16","v":-1.9375}]
[{"$f":"IF(ModelNo=B822,7,\"\")","v":""},"8SPS","Picture Window Glass Width",{"$f":"TRUNC((Frame_Width-(2*_DIM4)-1.6875)*16+0.5)/16","v":-1.625}]
[{"$f":"IF(ModelNo=B823,8,\"\")","v":""},"8SPS","Picture Window Glass Height",{"$f":"TRUNC((Frame_Height-2.5625)*16+0.5)/16","v":-2.5}]
[{"$f":"IF(ModelNo=B824,9,\"\")","v":""},"8SPS","Astragal Length",{"$f":"MROUND((_DIM4-1.625 )+0.40625,0.0625)","v":{"$error":"#NUM!"}}]
[{"$f":"IF(ModelNo=B825,10,\"\")","v":""},"8SPS","Screen Width",{"$f":"TRUNC((_DIM4-1.9375)*16+0.5)/16","v":-1.875}]
[{"$f":"IF(ModelNo=B826,11,\"\")","v":""},"8SPS","Screen Height",{"$f":"TRUNC((CDIM8SPS-2.1875)*16+0.5)/16","v":-1.875}]
[{"$f":"IF(ModelNo=B827,12,\"\")","v":""},"8SPS","Bottom Sash Weight",{"$f":"IF(ISERROR(BTM_WGT&\" \"&\"lb\"),\"N/A\",BTM_WGT&\" \"&\"lb\")","v":"N/A"}]
[{"$f":"IF(ModelNo=B828,13,\"\")","v":""},"8SPS","Balance Size (B&T)",{"$f":"IF(ISERROR(BTM_TUBE),\"N/A\",BTM_TUBE)","v":"N/A"}]
[{"$f":"IF(ModelNo=B829,14,\"\")","v":""},"8SPS","Egress Opening Width",{"$f":"IF(ISERROR(EW),\"N/A\",EW)","v":"N/A"}]
[{"$f":"IF(ModelNo=B830,15,\"\")","v":""},"8SPS","Egress Opening Height",{"$f":"IF(ISERROR(EH),\"N/A\",EH)","v":"N/A"}]
[{"$f":"IF(ModelNo=B831,16,\"\")","v":""},"8SPS","Egress Opening Area (sq.ft.)",{"$f":"IF(ISERROR(EO),\"N/A\",EO)","v":"N/A"}]
[{"$f":"IF(ModelNo=B832,1,\"\")","v":""},"8SPP","Sash Width",{"$f":"TRUNC((_DIM4-2.375)*16+0.5)/16","v":-2.3125}]
[{"$f":"IF(ModelNo=B833,2,\"\")","v":""},"8SPP","Sash Height",{"$f":"TRUNC((CDIM8SPP-1.0625)*16+0.5)/16","v":-1.25}]
[{"$f":"IF(ModelNo=B834,3,\"\")","v":""},"8SPP","Sash Glass Width",{"$f":"TRUNC((D832-2.5)*16+0.5)/16","v":-4.75}]
[{"$f":"IF(ModelNo=B835,4,\"\")","v":""},"8SPP","Sash Glass Height",{"$f":"TRUNC((D833-2.5625)*16+0.5)/16","v":-3.75}]
[{"$f":"IF(ModelNo=B836,5,\"\")","v":""},"8SPP","Fixed Glass Width",{"$f":"TRUNC((_DIM4-2.0625)*16+0.5)/16","v":-2}]
[{"$f":"IF(ModelNo=B837,6,\"\")","v":""},"8SPP","Fixed Glass Height",{"$f":"MROUND((((Frame_Height-_DIM3+0.25)/2)+0.34375)-2.25,0.0625)","v":{"$error":"#NUM!"}}]
[{"$f":"IF(ModelNo=B838,7,\"\")","v":""},"8SPP","Bottom PW Glass Width",{"$f":"TRUNC((_DIM4-2.0625)*16+0.5)/16","v":-2}]
[{"$f":"IF(ModelNo=B839,8,\"\")","v":""},"8SPP","Bottom PW Glass Height",{"$f":"TRUNC((_DIM3-2.125)*16+0.5)/16","v":-2.0625}]
[{"$f":"IF(ModelNo=B840,9,\"\")","v":""},"8SPP","Right PW Glass Width",{"$f":"TRUNC((Frame_Width-_DIM4-2.0625)*16+0.5)/16","v":-2}]
[{"$f":"IF(ModelNo=B841,10,\"\")","v":""},"8SPP","Right PW Glass Height",{"$f":"TRUNC((Frame_Height-2.5)*16+0.5)/16","v":-2.4375}]
[{"$f":"IF(ModelNo=B842,11,\"\")","v":""},"8SPP","Astragal Length",{"$f":"MROUND((_DIM4-1.625)+0.40625,0.0625)","v":{"$error":"#NUM!"}}]
[{"$f":"IF(ModelNo=B843,12,\"\")","v":""},"8SPP","Screen Width",{"$f":"TRUNC((_DIM4-1.9375)*16+0.5)/16","v":-1.875}]
[{"$f":"IF(ModelNo=B844,13,\"\")","v":""},"8SPP","Screen Height",{"$f":"TRUNC((CDIM8SPP-1.5)*16+0.5)/16","v":-1.6875}]
[{"$f":"IF(ModelNo=B845,14,\"\")","v":""},"8SPP","Bottom Sash Weight",{"$f":"IF(ISERROR(BTM_WGT&\" \"&\"lb\"),\"N/A\",BTM_WGT&\" \"&\"lb\")","v":"N/A"}]
[{"$f":"IF(ModelNo=B846,15,\"\")","v":""},"8SPP","Balance Size (B&T)",{"$f":"IF(ISERROR(BTM_TUBE),\"N/A\",BTM_TUBE)","v":"N/A"}]
[{"$f":"IF(ModelNo=B847,16,\"\")","v":""},"8SPP","Egress Opening Width",{"$f":"IF(ISERROR(EW),\"N/A\",EW)","v":"N/A"}]
[{"$f":"IF(ModelNo=B848,17,\"\")","v":""},"8SPP","Egress Opening Height",{"$f":"IF(ISERROR(EH),\"N/A\",EH)","v":"N/A"}]
[{"$f":"IF(ModelNo=B849,18,\"\")","v":""},"8SPP","Egress Opening Area (sq.ft.)",{"$f":"IF(ISERROR(EO),\"N/A\",EO)","v":"N/A"}]
[{"$f":"IF(ModelNo=B850,1,\"\")","v":""},"8POS","Sash Width",{"$f":"TRUNC((Frame_Width-2.8125)*16+0.5)/16","v":-2.75}]
[{"$f":"IF(ModelNo=B851,2,\"\")","v":""},"8POS","Sash Height",{"$f":"TRUNC((CDIM8POS-1.75)*16+0.5)/16","v":-1.25}]
[{"$f":"IF(ModelNo=B852,3,\"\")","v":""},"8POS","Sash Glass Width",{"$f":"TRUNC((D850-2.5625)*16+0.5)/16","v":-5.25}]
[{"$f":"IF(ModelNo=B853,4,\"\")","v":""},"8POS","Sash Glass Height",{"$f":"TRUNC((D851-2.5625)*16+0.5)/16","v":-3.75}]
[{"$f":"IF(ModelNo=B854,5,\"\")","v":""},"8POS","Fixed Glass Width",{"$f":"TRUNC((Frame_Width-2.5625)*16+0.5)/16","v":-2.5}]
[{"$f":"IF(ModelNo=B855,6,\"\")","v":""},"8POS","Fixed Glass Height",{"$f":"TRUNC((_DIM3+0.25-CDIM8POS-1.5625)*16+0.5)/16","v":-1.75}]
[{"$f":"IF(ModelNo=B856,7,\"\")","v":""},"8POS","Picture Window Glass Width",{"$f":"TRUNC((Frame_Width-2.5625)*16+0.5)/16","v":-2.5}]
[{"$f":"IF(ModelNo=B857,8,\"\")","v":""},"8POS","Picture Window Glass Height",{"$f":"Frame_Height-_DIM3-2.125","v":-2.125}]
[{"$f":"IF(ModelNo=B858,9,\"\")","v":""},"8POS","Astragal Length",{"$f":"Frame_Width-2.0625+0.40625","v":-1.65625}]
[{"$f":"IF(ModelNo=B859,10,\"\")","v":""},"8POS","Screen Width",{"$f":"Frame_Width-2.375","v":-2.375}]
[{"$f":"IF(ModelNo=B860,11,\"\")","v":""},"8POS","Screen Height",{"$f":"TRUNC((CDIM8POS-2.18125)*16+0.5)/16","v":-1.625}]
[{"$f":"IF(ModelNo=B861,12,\"\")","v":""},"8POS","Bottom Sash Weight",{"$f":"IF(ISERROR(BTM_WGT&\" \"&\"lb\"),\"N/A\",BTM_WGT&\" \"&\"lb\")","v":"N/A"}]
[{"$f":"IF(ModelNo=B862,13,\"\")","v":""},"8POS","Balance Size (B&T)",{"$f":"IF(ISERROR(BTM_TUBE),\"N/A\",BTM_TUBE)","v":"N/A"}]
[{"$f":"IF(ModelNo=B863,14,\"\")","v":""},"8POS","Egress Opening Width",{"$f":"IF(ISERROR(EW),\"N/A\",EW)","v":"N/A"}]
[{"$f":"IF(ModelNo=B864,15,\"\")","v":""},"8POS","Egress Opening Height",{"$f":"IF(ISERROR(EH),\"N/A\",EH)","v":"N/A"}]
[{"$f":"IF(ModelNo=B865,16,\"\")","v":""},"8POS","Egress Opening Area (sq.ft.)",{"$f":"IF(ISERROR(EO),\"N/A\",EO)","v":"N/A"}]
[{"$f":"IF(ModelNo=B866,1,\"\")","v":""},"8SOP","Sash Width",{"$f":"TRUNC((Frame_Width-2.8125)*16+0.5)/16","v":-2.75}]
[{"$f":"IF(ModelNo=B867,2,\"\")","v":""},"8SOP","Sash Height",{"$f":"TRUNC((CDIM8SOP-1.0625)*16+0.5)/16","v":-1.25}]
[{"$f":"IF(ModelNo=B868,3,\"\")","v":""},"8SOP","Sash Glass Width",{"$f":"TRUNC((D866-2.5625)*16+0.5)/16","v":-5.25}]
[{"$f":"IF(ModelNo=B869,4,\"\")","v":""},"8SOP","Sash Glass Height",{"$f":"TRUNC((D867-2.5625)*16+0.5)/16","v":-3.75}]
[{"$f":"IF(ModelNo=B870,5,\"\")","v":""},"8SOP","Fixed Glass Width",{"$f":"TRUNC((Frame_Width-2.5625)*16+0.5)/16","v":-2.5}]
[{"$f":"IF(ModelNo=B871,6,\"\")","v":""},"8SOP","Fixed Glass Height",{"$f":"TRUNC((CDIM8SOP-2.25)*16+0.5)/16","v":-2.4375}]
[{"$f":"IF(ModelNo=B872,7,\"\")","v":""},"8SOP","Picture Window Glass Width",{"$f":"TRUNC((Frame_Width-2.5625)*16+0.5)/16","v":-2.5}]
[{"$f":"IF(ModelNo=B873,8,\"\")","v":""},"8SOP","Picture Window Glass Height",{"$f":"_DIM3-2.125","v":-2.125}]
[{"$f":"IF(ModelNo=B874,9,\"\")","v":""},"8SOP","Astragal Length",{"$f":"Frame_Width-2.0625+0.40625","v":-1.65625}]
[{"$f":"IF(ModelNo=B875,10,\"\")","v":""},"8SOP","Screen Width",{"$f":"Frame_Width-2.375","v":-2.375}]
[{"$f":"IF(ModelNo=B876,11,\"\")","v":""},"8SOP","Screen Height",{"$f":"TRUNC((CDIM8SOP-1.5)*16+0.5)/16","v":-1.6875}]
[{"$f":"IF(ModelNo=B877,12,\"\")","v":""},"8SOP","Bottom Sash Weight",{"$f":"IF(ISERROR(BTM_WGT&\" \"&\"lb\"),\"N/A\",BTM_WGT&\" \"&\"lb\")","v":"N/A"}]
[{"$f":"IF(ModelNo=B878,13,\"\")","v":""},"8SOP","Balance Size (B&T)",{"$f":"IF(ISERROR(BTM_TUBE),\"N/A\",BTM_TUBE)","v":"N/A"}]
[{"$f":"IF(ModelNo=B879,14,\"\")","v":""},"8SOP","Egress Opening Width",{"$f":"IF(ISERROR(EW),\"N/A\",EW)","v":"N/A"}]
[{"$f":"IF(ModelNo=B880,15,\"\")","v":""},"8SOP","Egress Opening Height",{"$f":"IF(ISERROR(EH),\"N/A\",EH)","v":"N/A"}]
[{"$f":"IF(ModelNo=B881,16,\"\")","v":""},"8SOP","Egress Opening Area (sq.ft.)",{"$f":"IF(ISERROR(EO),\"N/A\",EO)","v":"N/A"}]
[{"$f":"IF(ModelNo=B882,1,\"\")","v":""},"8PS3","left Sash Width",{"$f":"TRUNC((_DIM4-2.375)*16+0.5)/16","v":-2.3125}]
[{"$f":"IF(ModelNo=B883,2,\"\")","v":""},"8PS3","Right Sash Width",{"$f":"TRUNC((Frame_Width-_DIM4-2.375)*16+0.5)/16","v":-2.3125}]
[{"$f":"IF(ModelNo=B884,3,\"\")","v":""},"8PS3","Left & Right Sash Height",{"$f":"TRUNC((CDIM8PS3-1.75)*16+0.5)/16","v":-1.25}]
[{"$f":"IF(ModelNo=B885,4,\"\")","v":""},"8PS3","Left Sash Glass Width",{"$f":"TRUNC((D882-2.5625)*16+0.5)/16","v":-4.8125}]
[{"$f":"IF(ModelNo=B886,5,\"\")","v":""},"8PS3","Right Sash Glass Width",{"$f":"TRUNC((D883-2.5625)*16+0.5)/16","v":-4.8125}]
[{"$f":"IF(ModelNo=B887,6,\"\")","v":""},"8PS3","Left & Right Sash Glass Height",{"$f":"TRUNC((D884-2.5625)*16+0.5)/16","v":-3.75}]
[{"$f":"IF(ModelNo=B888,7,\"\")","v":""},"8PS3","Left Fixed Glass Width",{"$f":"TRUNC((_DIM4-2.125)*16+0.5)/16","v":-2.0625}]
[{"$f":"IF(ModelNo=B889,8,\"\")","v":""},"8PS3","Right Fixed Glass Width",{"$f":"TRUNC((Frame_Width-_DIM4-2.125)*16+0.5)/16","v":-2.0625}]
[{"$f":"IF(ModelNo=B890,9,\"\")","v":""},"8PS3","Left & Right Fixed Glass Height",{"$f":"TRUNC((_DIM3+0.25-CDIM8PS3-1.5625)*16+0.5)/16","v":-1.75}]
[{"$f":"IF(ModelNo=B891,10,\"\")","v":""},"8PS3","Picture Window Glass Width",{"$f":"TRUNC((Frame_Width-2.5625)*16+0.5)/16","v":-2.5}]
[{"$f":"IF(ModelNo=B892,11,\"\")","v":""},"8PS3","Picture Window Glass Height",{"$f":"Frame_Height-_DIM3-2.125","v":-2.125}]
[{"$f":"IF(ModelNo=B893,12,\"\")","v":""},"8PS3","Left Astragal Length",{"$f":"MROUND(((_DIM4)-1.5625)+0.40625,0.0625)","v":{"$error":"#NUM!"}}]
[{"$f":"IF(ModelNo=B894,13,\"\")","v":""},"8PS3","Right Astragal Length",{"$f":"MROUND(((Frame_Width-_DIM4)-1.5625)+0.40625,0.0625)","v":{"$error":"#NUM!"}}]
[{"$f":"IF(ModelNo=B895,14,\"\")","v":""},"8PS3","Left Screen Width",{"$f":"_DIM4-1.9375","v":-1.9375}]
[{"$f":"IF(ModelNo=B896,15,\"\")","v":""},"8PS3","Right Screen Width",{"$f":"(Frame_Width-_DIM4)-1.9375","v":-1.9375}]
[{"$f":"IF(ModelNo=B897,16,\"\")","v":""},"8PS3","Left & Right Screen Height",{"$f":"TRUNC((CDIM8PS3-2.1875)*16+0.5)/16","v":-1.6875}]
[{"$f":"IF(ModelNo=B898,17,\"\")","v":""},"8PS3","Left Sash Weight",{"$f":"IF(ISERROR(BTM_WGT&\" \"&\"lb\"),\"N/A\",BTM_WGT&\" \"&\"lb\")","v":"N/A"}]
[{"$f":"IF(ModelNo=B899,18,\"\")","v":""},"8PS3","Left Sash Balance Size (B&T)",{"$f":"IF(ISERROR(BTM_TUBE),\"N/A\",BTM_TUBE)","v":"N/A"}]
[{"$f":"IF(ModelNo=B900,19,\"\")","v":""},"8PS3","Right Sash Weight",{"$f":"IF(ISERROR(TOP_WGT&\" \"&\"lb\"),\"N/A\",TOP_WGT&\" \"&\"lb\")","v":"N/A"}]
[{"$f":"IF(ModelNo=B901,20,\"\")","v":""},"8PS3","Right Sash Balance Size (B&T)",{"$f":"IF(ISERROR(TOP_TUBE),\"N/A\",TOP_TUBE)","v":"N/A"}]
[{"$f":"IF(ModelNo=B902,21,\"\")","v":""},"8PS3",{"$f":"IF(_DIM4=(W/2),\"Egress Width for Left & Right\",IF(_DIM4<(W/2),\"Egress Width for Right Sash\",IF(_DIM4>(W/2),\"Egress Width for Left Sash\",\"\")))","v":"Egress Width for Left & Right"},{"$f":"IF(ISERROR(EW),\"N/A\",EW)","v":"N/A"}]
[{"$f":"IF(ModelNo=B903,22,\"\")","v":""},"8PS3","Egress Opening Height",{"$f":"IF(ISERROR(EH),\"N/A\",EH)","v":"N/A"}]
[{"$f":"IF(ModelNo=B904,23,\"\")","v":""},"8PS3",{"$f":"IF(_DIM4=(W/2),\"Egress Area for Left & Right\",IF(_DIM4<(W/2),\"Egress Area for Right Sash\",IF(_DIM4>(W/2),\"Egress Area for Left Sash\",\"\")))","v":"Egress Area for Left & Right"},{"$f":"IF(ISERROR(EO),\"N/A\",EO)","v":"N/A"}]
[{"$f":"IF(ModelNo=B905,1,\"\")","v":""},"8SP3","left Sash Width",{"$f":"TRUNC((_DIM4-2.375)*16+0.5)/16","v":-2.3125}]
[{"$f":"IF(ModelNo=B906,2,\"\")","v":""},"8SP3","Right Sash Width",{"$f":"TRUNC((Frame_Width-_DIM4-2.375)*16+0.5)/16","v":-2.3125}]
[{"$f":"IF(ModelNo=B907,3,\"\")","v":""},"8SP3","Left & Right Sash Height",{"$f":"TRUNC((CDIM8SP3-1.0625)*16+0.5)/16","v":-1.25}]
[{"$f":"IF(ModelNo=B908,4,\"\")","v":""},"8SP3","Left Sash Glass Width",{"$f":"TRUNC((D905-2.5625)*16+0.5)/16","v":-4.8125}]
[{"$f":"IF(ModelNo=B909,5,\"\")","v":""},"8SP3","Right Sash Glass Width",{"$f":"TRUNC((D906-2.5625)*16+0.5)/16","v":-4.8125}]
[{"$f":"IF(ModelNo=B910,6,\"\")","v":""},"8SP3","Left & Right Sash Glass Height",{"$f":"TRUNC((D907-2.5625)*16+0.5)/16","v":-3.75}]
[{"$f":"IF(ModelNo=B911,7,\"\")","v":""},"8SP3","Left Fixed Glass Width",{"$f":"TRUNC((_DIM4-2.125)*16+0.5)/16","v":-2.0625}]
[{"$f":"IF(ModelNo=B912,8,\"\")","v":""},"8SP3","Right Fixed Glass Width",{"$f":"TRUNC((Frame_Width-_DIM4-2.125)*16+0.5)/16","v":-2.0625}]
[{"$f":"IF(ModelNo=B913,9,\"\")","v":""},"8SP3","Left & Right Fixed Glass Height",{"$f":"TRUNC((Frame_Height-_DIM3+0.25-CDIM8SP3-2.25)*16+0.5)/16","v":-1.75}]
[{"$f":"IF(ModelNo=B914,10,\"\")","v":""},"8SP3","Picture Window Glass Width",{"$f":"TRUNC((Frame_Width-2.5625)*16+0.5)/16","v":-2.5}]
[{"$f":"IF(ModelNo=B915,11,\"\")","v":""},"8SP3","Picture Window Glass Height",{"$f":"_DIM3-2.125","v":-2.125}]
[{"$f":"IF(ModelNo=B916,12,\"\")","v":""},"8SP3","Left Astragal Length",{"$f":"MROUND(((_DIM4)-1.5625)+0.40625,0.0625)","v":{"$error":"#NUM!"}}]
[{"$f":"IF(ModelNo=B917,13,\"\")","v":""},"8SP3","Right Astragal Length",{"$f":"MROUND(((Frame_Width-_DIM4)-1.5625)+0.40625,0.0625)","v":{"$error":"#NUM!"}}]
[{"$f":"IF(ModelNo=B918,14,\"\")","v":""},"8SP3","Left Screen Width",{"$f":"_DIM4-1.9375","v":-1.9375}]
[{"$f":"IF(ModelNo=B919,15,\"\")","v":""},"8SP3","Right Screen Width",{"$f":"(Frame_Width-_DIM4)-1.9375","v":-1.9375}]
[{"$f":"IF(ModelNo=B920,16,\"\")","v":""},"8SP3","Left & Right Screen Height",{"$f":"TRUNC((CDIM8SP3-1.5)*16+0.5)/16","v":-1.6875}]
[{"$f":"IF(ModelNo=B921,17,\"\")","v":""},"8SP3","Left Sash Weight",{"$f":"IF(ISERROR(BTM_WGT&\" \"&\"lb\"),\"N/A\",BTM_WGT&\" \"&\"lb\")","v":"N/A"}]
[{"$f":"IF(ModelNo=B922,18,\"\")","v":""},"8SP3","Left Sash Balance Size (B&T)",{"$f":"IF(ISERROR(BTM_TUBE),\"N/A\",BTM_TUBE)","v":"N/A"}]
[{"$f":"IF(ModelNo=B923,19,\"\")","v":""},"8SP3","Right Sash Weight",{"$f":"IF(ISERROR(TOP_WGT&\" \"&\"lb\"),\"N/A\",TOP_WGT&\" \"&\"lb\")","v":"N/A"}]
[{"$f":"IF(ModelNo=B924,20,\"\")","v":""},"8SP3","Right Sash Balance Size (B&T)",{"$f":"IF(ISERROR(TOP_TUBE),\"N/A\",TOP_TUBE)","v":"N/A"}]
[{"$f":"IF(ModelNo=B925,21,\"\")","v":""},"8SP3",{"$f":"IF(_DIM4=(W/2),\"Egress Width for Left & Right\",IF(_DIM4>(W/2),\"Egress Width for Right Sash\",IF(_DIM4<(W/2),\"Egress Width for Left Sash\",\"\")))","v":"Egress Width for Left & Right"},{"$f":"IF(ISERROR(EW),\"N/A\",EW)","v":"N/A"}]
[{"$f":"IF(ModelNo=B926,22,\"\")","v":""},"8SP3","Egress Opening Height",{"$f":"IF(ISERROR(EH),\"N/A\",EH)","v":"N/A"}]
[{"$f":"IF(ModelNo=B927,23,\"\")","v":""},"8SP3",{"$f":"IF(_DIM4=(W/2),\"Egress Area for Left & Right\",IF(_DIM4>(W/2),\"Egress Area for Right Sash\",IF(_DIM4<(W/2),\"Egress Area for Left Sash\",\"\")))","v":"Egress Area for Left & Right"},{"$f":"IF(ISERROR(EO),\"N/A\",EO)","v":"N/A"}]
[{"$f":"IF(ModelNo=B928,1,\"\")","v":""},"6COP","Operating Sash Width",{"$f":"TRUNC((Frame_Width-1.625)*16+0.5)/16","v":-1.5625}]
[{"$f":"IF(ModelNo=B929,2,\"\")","v":""},"6COP","Operating Sash Height",{"$f":"TRUNC((Frame_Height-_DIM3-1.25)*16+0.5)/16","v":-1.1875}]
[{"$f":"IF(ModelNo=B930,3,\"\")","v":""},"6COP","Vent Wrap Sash Width",{"$f":"TRUNC((Frame_Width-1.625)*16+0.5)/16","v":-1.5625}]
[{"$f":"IF(ModelNo=B931,4,\"\")","v":""},"6COP","Vent Wrap Sash Height",{"$f":"TRUNC((_DIM3-1.25)*16+0.5)/16","v":-1.1875}]
[{"$f":"IF(ModelNo=B932,5,\"\")","v":""},"6COP","Sash Glass Width",{"$f":"D928-3.9375","v":-5.5}]
[{"$f":"IF(ModelNo=B933,6,\"\")","v":""},"6COP","Sash Glass Height",{"$f":"D929-3.9375","v":-5.125}]
[{"$f":"IF(ModelNo=B934,7,\"\")","v":""},"6COP","PW Glass Width (No VW)",{"$f":"Frame_Width-4.125","v":-4.125}]
[{"$f":"IF(ModelNo=B935,8,\"\")","v":""},"6COP","PW Glass Height (No VW)",{"$f":"_DIM3-3.75","v":-3.75}]
[{"$f":"IF(ModelNo=B936,9,\"\")","v":""},"6COP","PW Glass Width (with VW)",{"$f":"D930-3.9375","v":-5.5}]
[{"$f":"IF(ModelNo=B937,10,\"\")","v":""},"6COP","PW Glass Height (with VW)",{"$f":"D931-3.9375","v":-5.125}]
[{"$f":"IF(ModelNo=B938,11,\"\")","v":""},"6COP","Screen Width",{"$f":"D928-3.3125","v":-4.875}]
[{"$f":"IF(ModelNo=B939,12,\"\")","v":""},"6COP","Screen Height",{"$f":"D929-3.3125","v":-4.5}]
[{"$f":"IF(ModelNo=B940,13,\"\")","v":""},"6COP","Egress Opening Width (Standard Hinge)",{"$f":"IF(ISERROR(EW),\"N/A\",EW)","v":"N/A"}]
[{"$f":"IF(ModelNo=B941,14,\"\")","v":""},"6COP","Egress Opening Height (Standard Hinge)",{"$f":"IF(ISERROR(EH),\"N/A\",EH)","v":"N/A"}]
[{"$f":"IF(ModelNo=B942,15,\"\")","v":""},"6COP","Egress Opening Area (Standard Hinge)",{"$f":"IF(ISERROR(EO),\"N/A\",EO)","v":"N/A"}]
[{"$f":"IF(ModelNo=B943,16,\"\")","v":""},"6COP",{"$f":"IF(OR(Frame_Width<25.75,Frame_Width>31.75),\"Egress Hardware Not Available For This Width\",\"Egress Opening Width (Egress Hinge)\")","v":"Egress Hardware Not Available For This Width"},{"$f":"IF(OR(Frame_Width<25.75,Frame_Width>31.75),\"N/A\",Frame_Width-7.125)","v":"N/A"}]
[{"$f":"IF(ModelNo=B944,17,\"\")","v":""},"6COP",{"$f":"IF(OR(Frame_Width<25.75,Frame_Width>31.75),\"Egress Hardware Not Available For This Width\",\"Egress Opening Height (Egress Hinge)\")","v":"Egress Hardware Not Available For This Width"},{"$f":"IF(OR(Frame_Width<25.75,Frame_Width>31.75),\"N/A\",Frame_Height-_DIM3-5.125)","v":"N/A"}]
[{"$f":"IF(ModelNo=B945,18,\"\")","v":""},"6COP",{"$f":"IF(OR(Frame_Width<25.75,Frame_Width>31.75),\"Egress Hardware Not Available For This Width\",\"Egress Opening Area w/Egress Hinge (sq.ft.)\")","v":"Egress Hardware Not Available For This Width"},{"$f":"IF(OR(Frame_Width<25.75,Frame_Width>31.75),\"N/A\",(D943*D944)/144)","v":"N/A"}]
[{"$f":"IF(ModelNo=B946,1,\"\")","v":""},"6POA","Operating Sash Width",{"$f":"TRUNC((Frame_Width-1.625)*16+0.5)/16","v":-1.5625}]
[{"$f":"IF(ModelNo=B947,2,\"\")","v":""},"6POA","Operating Sash Height",{"$f":"TRUNC((_DIM3-1.25)*16+0.5)/16","v":-1.1875}]
[{"$f":"IF(ModelNo=B948,3,\"\")","v":""},"6POA","Vent Wrap Sash Width",{"$f":"TRUNC((Frame_Width-1.625)*16+0.5)/16","v":-1.5625}]
[{"$f":"IF(ModelNo=B949,4,\"\")","v":""},"6POA","Vent Wrap Sash Height",{"$f":"TRUNC((Frame_Height-_DIM3-1.25)*16+0.5)/16","v":-1.1875}]
[{"$f":"IF(ModelNo=B950,5,\"\")","v":""},"6POA","Sash Glass Width",{"$f":"D946-3.9375","v":-5.5}]
[{"$f":"IF(ModelNo=B951,6,\"\")","v":""},"6POA","Sash Glass Height",{"$f":"D947-3.9375","v":-5.125}]
[{"$f":"IF(ModelNo=B952,7,\"\")","v":""},"6POA","PW Glass Width (No VW)",{"$f":"Frame_Width-4.125","v":-4.125}]
[{"$f":"IF(ModelNo=B953,8,\"\")","v":""},"6POA","PW Glass Height (No VW)",{"$f":"Frame_Height-_DIM3-3.75","v":-3.75}]
[{"$f":"IF(ModelNo=B954,9,\"\")","v":""},"6POA","PW Glass Width (with VW)",{"$f":"D948-3.9375","v":-5.5}]
[{"$f":"IF(ModelNo=B955,10,\"\")","v":""},"6POA","PW Glass Height (with VW)",{"$f":"D949-3.9375","v":-5.125}]
[{"$f":"IF(ModelNo=B956,11,\"\")","v":""},"6POA","Screen Width",{"$f":"D946-3.3125","v":-4.875}]
[{"$f":"IF(ModelNo=B957,12,\"\")","v":""},"6POA","Screen Height",{"$f":"D947-3.3125","v":-4.5}]
[{"$f":"IF(ModelNo=B958,13,\"\")","v":""},"6POA","Awning does not meet Egress","N/A"]
[{"$f":"IF(ModelNo=B959,1,\"\")","v":""},"62WC","Left Sash Width",{"$f":"TRUNC((_DIM4-1.25)*16+0.5)/16","v":-1.1875}]
[{"$f":"IF(ModelNo=B960,2,\"\")","v":""},"62WC","Right Sash Width",{"$f":"TRUNC((Frame_Width-_DIM4-1.25)*16+0.5)/16","v":-1.1875}]
[{"$f":"IF(ModelNo=B961,3,\"\")","v":""},"62WC","Left & Right Sash Height",{"$f":"TRUNC((Frame_Height-1.625)*16+0.5)/16","v":-1.5625},null,null,null,{"$f":"IF(_DIM4>31.25,1,0)","v":0}]
[{"$f":"IF(ModelNo=B962,4,\"\")","v":""},"62WC","Left Sash Glass Width",{"$f":"D959-3.9375","v":-5.125}]
[{"$f":"IF(ModelNo=B963,5,\"\")","v":""},"62WC","Right Sash Glass Width",{"$f":"D960-3.9375","v":-5.125}]
[{"$f":"IF(ModelNo=B964,6,\"\")","v":""},"62WC","Left & Right Sash Glass Height",{"$f":"D961-3.9375","v":-5.5}]
[{"$f":"IF(ModelNo=B965,7,\"\")","v":""},"62WC","Left Screen Width",{"$f":"D959-3.3125","v":-4.5}]
[{"$f":"IF(ModelNo=B966,8,\"\")","v":""},"62WC","Right Screen Width",{"$f":"D960-3.3125","v":-4.5}]
[{"$f":"IF(ModelNo=B967,9,\"\")","v":""},"62WC","Screen Height",{"$f":"D961-3.3125","v":-4.875}]
[{"$f":"IF(ModelNo=B968,10,\"\")","v":""},"62WC",{"$f":"IF(_DIM4=(Frame_Width/2),\"Egress Width for Left & Right (Standard Hinge)\",IF(_DIM4>(Frame_Width/2),\"Egress Width for Left Sash (Standard Hinge)\",IF(_DIM4<(Frame_Width/2),\"Egress Width for Right Sash (Standard Hinge)\",0)))","v":"Egress Width for Left & Right (Standard Hinge)"},{"$f":"IF(ISERROR(EW),\"N/A\",EW)","v":"N/A"},{"$f":"IF(AND(_DIM4=(Frame_Width/2),OR(_DIM4>25.75,_DIM4<31.75)),1,0)","v":1},"L & R Egress Opening Width (Egress Hinge)"]
[{"$f":"IF(ModelNo=B969,11,\"\")","v":""},"62WC","Egress Opening Height (Standard Hinge)",{"$f":"IF(ISERROR(EH),\"N/A\",EH)","v":"N/A"},{"$f":"IF(AND(_DIM4>(Frame_Width/2),OR(_DIM4>25.75,_DIM4<31.75)),2,0)","v":0},"Left Only Egress Opening Width (Egress Hinge)"]
[{"$f":"IF(ModelNo=B970,12,\"\")","v":""},"62WC",{"$f":"IF(_DIM4=(Frame_Width/2),\"Egress Area for Left & Right (Standard Hinge)\",IF(_DIM4>(Frame_Width/2),\"Egress Area for Left Sash (Standard Hinge)\",IF(_DIM4<(Frame_Width/2),\"Egress Area for Right Sash (Standard Hinge)\",0)))","v":"Egress Area for Left & Right (Standard Hinge)"},{"$f":"IF(ISERROR(EO),\"N/A\",EO)","v":"N/A"},{"$f":"IF(AND(_DIM4<(Frame_Width/2),OR((Frame_Width-_DIM4)>25.75,(Frame_Width-_DIM4)<31.75)),3,0)","v":0},"Righ Only Egress Opening Width (Egress Hinge)"]
[{"$f":"IF(ModelNo=B971,13,\"\")","v":""},"62WC",{"$f":"F972","v":"L & R Egress Opening Width (Egress Hinge)"},{"$f":"IF(OR(E972=1,E972=2),_DIM4-7.125,IF(E972=3,(Frame_Width-_DIM4)-7.125,\"N/A\"))","v":-7.125},{"$f":"IF(MAX(E968:E970)=0,4,0)","v":0},"Egress Hardware Not Available For This Width"]
[{"$f":"IF(ModelNo=B972,14,\"\")","v":""},"62WC",{"$f":"IF(E972=4,\"Egress Hardware Not Available For This Width\",\"Egress Opening Height (Egress Hinge)\")","v":"Egress Opening Height (Egress Hinge)"},{"$f":"IF(E972=4,\"N/A\",Frame_Height-5.125)","v":-5.125},{"$f":"MAX(E968:E971)","v":1},{"$f":"VLOOKUP(E972,E968:F971,2,FALSE)","v":"L & R Egress Opening Width (Egress Hinge)"}]
[{"$f":"IF(ModelNo=B973,15,\"\")","v":""},"62WC",{"$f":"IF(E972=4,\"Egress Hardware Not Available For This Width\",\"Egress Opening Area w/Egress Hinge (sq.ft.)\")","v":"Egress Opening Area w/Egress Hinge (sq.ft.)"},{"$f":"IF(E972=4,\"N/A\",(D971*D972)/144)","v":0.25358072916666669}]
[{"$f":"IF(ModelNo=B974,1,\"\")","v":""},"62CP","Left Sash Width",{"$f":"TRUNC((_DIM4-1.25)*16+0.5)/16","v":-1.1875}]
[{"$f":"IF(ModelNo=B975,2,\"\")","v":""},"62CP","Right Sash Width",{"$f":"TRUNC((Frame_Width-_DIM4-1.25)*16+0.5)/16","v":-1.1875}]
[{"$f":"IF(ModelNo=B976,3,\"\")","v":""},"62CP","Left & Right Sash Height",{"$f":"TRUNC((Frame_Height-_DIM3-1.25)*16+0.5)/16","v":-1.1875}]
[{"$f":"IF(ModelNo=B977,4,\"\")","v":""},"62CP","Vent Wrap Sash Width",{"$f":"Frame_Width-1.625","v":-1.625}]
[{"$f":"IF(ModelNo=B978,5,\"\")","v":""},"62CP","Vent Wrap Sash Height",{"$f":"TRUNC((_DIM3-1.25)*16+0.5)/16","v":-1.1875}]
[{"$f":"IF(ModelNo=B979,6,\"\")","v":""},"62CP","Left Sash Glass Width",{"$f":"D974-3.9375","v":-5.125}]
[{"$f":"IF(ModelNo=B980,7,\"\")","v":""},"62CP","Right Sash Glass Width",{"$f":"D975-3.9375","v":-5.125}]
[{"$f":"IF(ModelNo=B981,8,\"\")","v":""},"62CP","Left & Right Sash Glass Height",{"$f":"D976-3.9375","v":-5.125}]
[{"$f":"IF(ModelNo=B982,9,\"\")","v":""},"62CP","Picture Window Glass Width (No VW)",{"$f":"Frame_Width-4.125","v":-4.125}]
[{"$f":"IF(ModelNo=B983,10,\"\")","v":""},"62CP","Picture Window Glass Height (No VW)",{"$f":"_DIM3-3.75","v":-3.75}]
[{"$f":"IF(ModelNo=B984,11,\"\")","v":""},"62CP","Picture Window Glass Width (With VW)",{"$f":"D977-3.9375","v":-5.5625}]
[{"$f":"IF(ModelNo=B985,12,\"\")","v":""},"62CP","Picture Window Glass Height (With VW)",{"$f":"D978-3.9375","v":-5.125}]
[{"$f":"IF(ModelNo=B986,13,\"\")","v":""},"62CP","Left Screen Width",{"$f":"D974-3.3125","v":-4.5}]
[{"$f":"IF(ModelNo=B987,14,\"\")","v":""},"62CP","Right Screen Width",{"$f":"D975-3.3125","v":-4.5}]
[{"$f":"IF(ModelNo=B988,15,\"\")","v":""},"62CP","Screen Height",{"$f":"D976-3.3125","v":-4.5}]
[{"$f":"IF(ModelNo=B989,16,\"\")","v":""},"62CP",{"$f":"IF(_DIM4=(Frame_Width/2),\"Egress Width for Left & Right (Standard Hinge)\",IF(_DIM4>(Frame_Width/2),\"Egress Width for Left Sash (Standard Hinge)\",IF(_DIM4<(Frame_Width/2),\"Egress Width for Right Sash (Standard Hinge)\",0)))","v":"Egress Width for Left & Right (Standard Hinge)"},{"$f":"IF(ISERROR(EW),\"N/A\",EW)","v":"N/A"},{"$f":"IF(AND(_DIM4=(Frame_Width/2),OR(_DIM4>25.75,_DIM4<31.75)),1,0)","v":1},"L & R Egress Opening Width (Egress Hinge)"]
[{"$f":"IF(ModelNo=B990,17,\"\")","v":""},"62CP","Egress Opening Height (Standard Hinge)",{"$f":"IF(ISERROR(EH),\"N/A\",EH)","v":"N/A"},{"$f":"IF(AND(_DIM4>(Frame_Width/2),OR(_DIM4>25.75,_DIM4<31.75)),2,0)","v":0},"Left Only Egress Opening Width (Egress Hinge)"]
[{"$f":"IF(ModelNo=B991,18,\"\")","v":""},"62CP",{"$f":"IF(_DIM4=(Frame_Width/2),\"Egress Area for Left & Right (Standard Hinge)\",IF(_DIM4>(Frame_Width/2),\"Egress Area for Left Sash (Standard Hinge)\",IF(_DIM4<(Frame_Width/2),\"Egress Area for Right Sash (Standard Hinge)\",0)))","v":"Egress Area for Left & Right (Standard Hinge)"},{"$f":"IF(ISERROR(EO),\"N/A\",EO)","v":"N/A"},{"$f":"IF(AND(_DIM4<(Frame_Width/2),OR((Frame_Width-_DIM4)>25.75,(Frame_Width-_DIM4)<31.75)),3,0)","v":0},"Righ Only Egress Opening Width (Egress Hinge)"]
[{"$f":"IF(ModelNo=B992,19,\"\")","v":""},"62CP",{"$f":"F993","v":"L & R Egress Opening Width (Egress Hinge)"},{"$f":"IF(OR(E993=1,E993=2),_DIM4-7.125,IF(E993=3,(Frame_Width-_DIM4)-7.125,\"N/A\"))","v":-7.125},{"$f":"IF(MAX(E989:E991)=0,4,0)","v":0},"Egress Hardware Not Available For This Width"]
[{"$f":"IF(ModelNo=B993,20,\"\")","v":""},"62CP",{"$f":"IF(E993=4,\"Egress Hardware Not Available For This Width\",\"Egress Opening Height (Egress Hinge)\")","v":"Egress Opening Height (Egress Hinge)"},{"$f":"IF(E993=4,\"N/A\",Frame_Height-_DIM3-5.125)","v":-5.125},{"$f":"MAX(E989:E992)","v":1},{"$f":"VLOOKUP(E993,E989:F992,2,FALSE)","v":"L & R Egress Opening Width (Egress Hinge)"}]
[{"$f":"IF(ModelNo=B994,21,\"\")","v":""},"62CP",{"$f":"IF(E993=4,\"Egress Hardware Not Available For This Width\",\"Egress Opening Area w/Egress Hinge (sq.ft.)\")","v":"Egress Opening Area w/Egress Hinge (sq.ft.)"},{"$f":"IF(E993=4,\"N/A\",(D992*D993)/144)","v":0.25358072916666669}]
[{"$f":"IF(ModelNo=B995,1,\"\")","v":""},"6P2C","Left Sash Width",{"$f":"TRUNC((_DIM4-1.25)*16+0.5)/16","v":-1.1875}]
[{"$f":"IF(ModelNo=B996,2,\"\")","v":""},"6P2C","Right Sash Width",{"$f":"TRUNC((Frame_Width-_DIM4-1.25)*16+0.5)/16","v":-1.1875}]
[{"$f":"IF(ModelNo=B997,3,\"\")","v":""},"6P2C","Left & Right Sash Height",{"$f":"TRUNC((_DIM3-1.25)*16+0.5)/16","v":-1.1875}]
[{"$f":"IF(ModelNo=B998,4,\"\")","v":""},"6P2C","Vent Wrap Sash Width",{"$f":"Frame_Width-1.625","v":-1.625}]
[{"$f":"IF(ModelNo=B999,5,\"\")","v":""},"6P2C","Vent Wrap Sash Height",{"$f":"TRUNC((Frame_Height-_DIM3-1.25)*16+0.5)/16","v":-1.1875}]
[{"$f":"IF(ModelNo=B1000,6,\"\")","v":""},"6P2C","Left Sash Glass Width",{"$f":"D995-3.9375","v":-5.125}]
[{"$f":"IF(ModelNo=B1001,7,\"\")","v":""},"6P2C","Right Sash Glass Width",{"$f":"D996-3.9375","v":-5.125}]
[{"$f":"IF(ModelNo=B1002,8,\"\")","v":""},"6P2C","Left & Right Sash Glass Height",{"$f":"D997-3.9375","v":-5.125}]
[{"$f":"IF(ModelNo=B1003,9,\"\")","v":""},"6P2C","Picture Window Glass Width (No VW)",{"$f":"Frame_Width-4.125","v":-4.125}]
[{"$f":"IF(ModelNo=B1004,10,\"\")","v":""},"6P2C","Picture Window Glass Height (No VW)",{"$f":"Frame_Height-_DIM3-3.75","v":-3.75}]
[{"$f":"IF(ModelNo=B1005,11,\"\")","v":""},"6P2C","Picture Window Glass Width (With VW)",{"$f":"D998-3.9375","v":-5.5625}]
[{"$f":"IF(ModelNo=B1006,12,\"\")","v":""},"6P2C","Picture Window Glass Height (With VW)",{"$f":"D999-3.9375","v":-5.125}]
[{"$f":"IF(ModelNo=B1007,13,\"\")","v":""},"6P2C","Left Screen Width",{"$f":"D995-3.3125","v":-4.5}]
[{"$f":"IF(ModelNo=B1008,14,\"\")","v":""},"6P2C","Right Screen Width",{"$f":"D996-3.3125","v":-4.5}]
[{"$f":"IF(ModelNo=B1009,15,\"\")","v":""},"6P2C","Screen Height",{"$f":"D997-3.3125","v":-4.5}]
[{"$f":"IF(ModelNo=B1010,16,\"\")","v":""},"6P2C",{"$f":"IF(_DIM4=(Frame_Width/2),\"Egress Width for Left & Right (Standard Hinge)\",IF(_DIM4>(Frame_Width/2),\"Egress Width for Left Sash (Standard Hinge)\",IF(_DIM4<(Frame_Width/2),\"Egress Width for Right Sash (Standard Hinge)\",0)))","v":"Egress Width for Left & Right (Standard Hinge)"},{"$f":"IF(ISERROR(EW),\"N/A\",EW)","v":"N/A"},{"$f":"IF(AND(_DIM4=(W/2),OR(_DIM4>25.75,_DIM4<31.75)),1,0)","v":1},"L & R Egress Opening Width (Egress Hinge)"]
[{"$f":"IF(ModelNo=B1011,17,\"\")","v":""},"6P2C","Egress Opening Height (Standard Hinge)",{"$f":"IF(ISERROR(EH),\"N/A\",EH)","v":"N/A"},{"$f":"IF(AND(_DIM4>(W/2),OR(_DIM4>25.75,_DIM4<31.75)),2,0)","v":0},"Left Only Egress Opening Width (Egress Hinge)"]
[{"$f":"IF(ModelNo=B1012,18,\"\")","v":""},"6P2C",{"$f":"IF(_DIM4=(Frame_Width/2),\"Egress Area for Left & Right (Standard Hinge)\",IF(_DIM4>(Frame_Width/2),\"Egress Area for Left Sash (Standard Hinge)\",IF(_DIM4<(Frame_Width/2),\"Egress Area for Right Sash (Standard Hinge)\",0)))","v":"Egress Area for Left & Right (Standard Hinge)"},{"$f":"IF(ISERROR(EO),\"N/A\",EO)","v":"N/A"},{"$f":"IF(AND(_DIM4<(W/2),OR((Frame_Width-_DIM4)>25.75,(Frame_Width-_DIM4)<31.75)),3,0)","v":0},"Righ Only Egress Opening Width (Egress Hinge)"]
[{"$f":"IF(ModelNo=B1013,19,\"\")","v":""},"6P2C",{"$f":"F1014","v":"L & R Egress Opening Width (Egress Hinge)"},{"$f":"IF(OR(E1014=1,E1014=2),_DIM4-7.125,IF(E1014=3,(Frame_Width-_DIM4)-7.125,\"N/A\"))","v":-7.125},{"$f":"IF(MAX(E1010:E1012)=0,4,0)","v":0},"Egress Hardware Not Available For This Width"]
[{"$f":"IF(ModelNo=B1014,20,\"\")","v":""},"6P2C",{"$f":"IF(E1014=4,\"Egress Hardware Not Available For This Width\",\"Egress Opening Height (Egress Hinge)\")","v":"Egress Opening Height (Egress Hinge)"},{"$f":"IF(E1014=4,\"N/A\",Frame_Height-_DIM3-5.125)","v":-5.125},{"$f":"MAX(E1010:E1013)","v":1},{"$f":"VLOOKUP(E1014,E1010:F1013,2,FALSE)","v":"L & R Egress Opening Width (Egress Hinge)"}]
[{"$f":"IF(ModelNo=B1015,21,\"\")","v":""},"6P2C",{"$f":"IF(E1014=4,\"Egress Hardware Not Available For This Width\",\"Egress Opening Area w/Egress Hinge (sq.ft.)\")","v":"Egress Opening Area w/Egress Hinge (sq.ft.)"},{"$f":"IF(E1014=4,\"N/A\",(D1013*D1014)/144)","v":0.25358072916666669}]
[{"$f":"IF(ModelNo=B1016,1,\"\")","v":""},"68CP","Operating Sash Width",{"$f":"IF(EXTSELECT=3,TRUNC((Frame_Width-_DIM4-1.25)*16+0.5)/16,TRUNC((_DIM4-1.25)*16+0.5)/16)","v":-1.1875}]
[{"$f":"IF(ModelNo=B1017,2,\"\")","v":""},"68CP","Operating Sash height",{"$f":"TRUNC((Frame_Height-1.625)*16+0.5)/16","v":-1.5625}]
[{"$f":"IF(ModelNo=B1018,3,\"\")","v":""},"68CP","Vent Wrap Sash Width",{"$f":"IF(EXTSELECT=3,TRUNC((_DIM4-1.25)*16+0.5)/16,TRUNC((Frame_Height-_DIM4-1.25)*16+0.5)/16)","v":-1.1875}]
[{"$f":"IF(ModelNo=B1019,4,\"\")","v":""},"68CP","Vent Wrap Sash Height",{"$f":"TRUNC((Frame_Height-1.625)*16+0.5)/16","v":-1.5625}]
[{"$f":"IF(ModelNo=B1020,5,\"\")","v":""},"68CP","Operating Sash Glass Width",{"$f":"D1016-3.9375","v":-5.125}]
[{"$f":"IF(ModelNo=B1021,6,\"\")","v":""},"68CP","Operating Sash Glass Height",{"$f":"D1017-3.9375","v":-5.5}]
[{"$f":"IF(ModelNo=B1022,7,\"\")","v":""},"68CP","Picture Window Glass Width (No VW)",{"$f":"IF(EXTSELECT=2,Frame_Width-_DIM4-3.75,_DIM4-3.75)","v":-3.75}]
[{"$f":"IF(ModelNo=B1023,8,\"\")","v":""},"68CP","Picture Window Glass Height (No VW)",{"$f":"Frame_Height-4.125","v":-4.125}]
[{"$f":"IF(ModelNo=B1024,9,\"\")","v":""},"68CP","Picture Window Glass Width (With VW)",{"$f":"D1018-3.9375","v":-5.125}]
[{"$f":"IF(ModelNo=B1025,10,\"\")","v":""},"68CP","Picture Window Glass Height (With VW)",{"$f":"D1019-3.9375","v":-5.5}]
[{"$f":"IF(ModelNo=B1026,11,\"\")","v":""},"68CP","Screen Width",{"$f":"D1016-3.3125","v":-4.5}]
[{"$f":"IF(ModelNo=B1027,12,\"\")","v":""},"68CP","Screen Height",{"$f":"D1017-3.3125","v":-4.875}]
[{"$f":"IF(ModelNo=B1028,13,\"\")","v":""},"68CP","Egress Opening Width (Standard Hinge)",{"$f":"IF(ISERROR(EW),\"N/A\",EW)","v":"N/A"}]
[{"$f":"IF(ModelNo=B1029,14,\"\")","v":""},"68CP","Egress Opening Height (Standard Hinge)",{"$f":"IF(ISERROR(EH),\"N/A\",EH)","v":"N/A"}]
[{"$f":"IF(ModelNo=B1030,15,\"\")","v":""},"68CP","Egress Opening Area (Standard Hinge)",{"$f":"IF(ISERROR(EO),\"N/A\",EO)","v":"N/A"}]
[{"$f":"IF(ModelNo=B1031,16,\"\")","v":""},"68CP",{"$f":"IF(OR((Frame_Width-_DIM4)<25.75,(Frame_Width-_DIM4)>31.75),\"Egress Hardware Not Available For This Width\",\"Egress Opening Width (Egress Hinge)\")","v":"Egress Hardware Not Available For This Width"},{"$f":"IF(OR((Frame_Width-_DIM4)<25.75,(Frame_Width-_DIM4)>31.75),\"N/A\",Frame_Width-_DIM4-7.125)","v":"N/A"}]
[{"$f":"IF(ModelNo=B1032,17,\"\")","v":""},"68CP",{"$f":"IF(OR((Frame_Width-_DIM4)<25.75,(Frame_Width-_DIM4)>31.75),\"Egress Hardware Not Available For This Width\",\"Egress Opening Height (Egress Hinge)\")","v":"Egress Hardware Not Available For This Width"},{"$f":"IF(OR((Frame_Width-_DIM4)<25.75,(Frame_Width-_DIM4)>31.75),\"N/A\",Frame_Height-5.125)","v":"N/A"}]
[{"$f":"IF(ModelNo=B1033,18,\"\")","v":""},"68CP",{"$f":"IF(OR((Frame_Width-_DIM4)<25.75,(Frame_Width-_DIM4)>31.75),\"Egress Hardware Not Available For This Width\",\"Egress Opening Area (Egress Hinge)\")","v":"Egress Hardware Not Available For This Width"},{"$f":"IF(OR((Frame_Width-_DIM4)<25.75,(Frame_Width-_DIM4)>31.75),\"N/A\",(D1031*D1032)/144)","v":"N/A"}]
[{"$f":"IF(ModelNo=B1034,1,\"\")","v":""},"6CPX","Operating Sash Width",{"$f":"IF(EXTSELECT=3,TRUNC((Frame_Width-_DIM4-1.25)*16+0.5)/16,TRUNC((_DIM4-1.25)*16+0.5)/16)","v":-1.1875}]
[{"$f":"IF(ModelNo=B1035,2,\"\")","v":""},"6CPX","Operating Sash Height",{"$f":"TRUNC((Frame_Height-_DIM3-1.25)*16+0.5)/16","v":-1.1875}]
[{"$f":"IF(ModelNo=B1036,3,\"\")","v":""},"6CPX","Top Vent Wrap Sash Width",{"$f":"IF(EXTSELECT=3,TRUNC((_DIM4-1.25)*16+0.5)/16,TRUNC((Frame_Width-_DIM4-1.25)*16+0.5)/16)","v":-1.1875}]
[{"$f":"IF(ModelNo=B1037,4,\"\")","v":""},"6CPX","Top Vent Wrap Sash Height",{"$f":"TRUNC((Frame_Height-_DIM3-1.25)*16+0.5)/16","v":-1.1875}]
[{"$f":"IF(ModelNo=B1038,5,\"\")","v":""},"6CPX","Bottom Vent Wrap Sash Width",{"$f":"Frame_Width-1.625","v":-1.625}]
[{"$f":"IF(ModelNo=B1039,6,\"\")","v":""},"6CPX","Bottom Vent Wrap Sash Height",{"$f":"TRUNC((_DIM3-1.25)*16+0.5)/16","v":-1.1875}]
[{"$f":"IF(ModelNo=B1040,7,\"\")","v":""},"6CPX","Operating Sash Glass Width",{"$f":"D1034-3.9375","v":-5.125}]
[{"$f":"IF(ModelNo=B1041,8,\"\")","v":""},"6CPX","Operating Sash Glass Height",{"$f":"D1035-3.9375","v":-5.125}]
[{"$f":"IF(ModelNo=B1042,9,\"\")","v":""},"6CPX","Top PW Glass Width (No VW)",{"$f":"IF(EXTSELECT=2,Frame_Width-_DIM4-3.75,_DIM4-3.75)","v":-3.75}]
[{"$f":"IF(ModelNo=B1043,10,\"\")","v":""},"6CPX","Top PW Glass Height (No VW)",{"$f":"Frame_Height-_DIM3-3.75","v":-3.75}]
[{"$f":"IF(ModelNo=B1044,11,\"\")","v":""},"6CPX","Top PW Glass Width (With VW)",{"$f":"D1036-3.9375","v":-5.125}]
[{"$f":"IF(ModelNo=B1045,12,\"\")","v":""},"6CPX","Top PW Glass Height (With VW)",{"$f":"D1037-3.9375","v":-5.125}]
[{"$f":"IF(ModelNo=B1046,13,\"\")","v":""},"6CPX","Bottom PW Glass Width (No VW)",{"$f":"Frame_Width-4.125","v":-4.125}]
[{"$f":"IF(ModelNo=B1047,14,\"\")","v":""},"6CPX","Bottom PW Glass Height (No VW)",{"$f":"_DIM3-3.75","v":-3.75}]
[{"$f":"IF(ModelNo=B1048,15,\"\")","v":""},"6CPX","Bottom PW Glass Width (With VW)",{"$f":"D1038-3.9375","v":-5.5625}]
[{"$f":"IF(ModelNo=B1049,16,\"\")","v":""},"6CPX","Bottom PW Glass Height (With VW)",{"$f":"D1039-3.9375","v":-5.125}]
[{"$f":"IF(ModelNo=B1050,17,\"\")","v":""},"6CPX","Screen Width",{"$f":"D1034-3.3125","v":-4.5}]
[{"$f":"IF(ModelNo=B1051,18,\"\")","v":""},"6CPX","Screen Height",{"$f":"D1035-3.3125","v":-4.5}]
[{"$f":"IF(ModelNo=B1052,19,\"\")","v":""},"6CPX","Egress Opening Width (Standard Hinge)",{"$f":"IF(ISERROR(EW),\"N/A\",EW)","v":"N/A"}]
[{"$f":"IF(ModelNo=B1053,20,\"\")","v":""},"6CPX","Egress Opening Height (Standard Hinge)",{"$f":"IF(ISERROR(EH),\"N/A\",EH)","v":"N/A"}]
[{"$f":"IF(ModelNo=B1054,21,\"\")","v":""},"6CPX","Egress Opening Area (Standard Hinge)",{"$f":"IF(ISERROR(EO),\"N/A\",EO)","v":"N/A"}]
[{"$f":"IF(ModelNo=B1055,22,\"\")","v":""},"6CPX",{"$f":"IF(OR((Frame_Width-_DIM4)<25.75,(Frame_Width-_DIM4)>31.75),\"Egress Hardware Not Available For This Width\",\"Egress Opening Width (Egress Hinge)\")","v":"Egress Hardware Not Available For This Width"},{"$f":"IF(OR((Frame_Width-_DIM4)<25.75,(Frame_Width-_DIM4)>31.75),\"N/A\",Frame_Width-_DIM4-7.125)","v":"N/A"}]
[{"$f":"IF(ModelNo=B1056,23,\"\")","v":""},"6CPX",{"$f":"IF(OR((Frame_Width-_DIM4)<25.75,(Frame_Width-_DIM4)>31.75),\"Egress Hardware Not Available For This Width\",\"Egress Opening Height (Egress Hinge)\")","v":"Egress Hardware Not Available For This Width"},{"$f":"IF(OR((Frame_Width-_DIM4)<25.75,(Frame_Width-_DIM4)>31.75),\"N/A\",Frame_Height-_DIM3-5.125)","v":"N/A"}]
[{"$f":"IF(ModelNo=B1057,24,\"\")","v":""},"6CPX",{"$f":"IF(OR((Frame_Width-_DIM4)<25.75,(Frame_Width-_DIM4)>31.75),\"Egress Hardware Not Available For This Width\",\"Egress Opening Area (Egress Hinge)\")","v":"Egress Hardware Not Available For This Width"},{"$f":"IF(OR((Frame_Width-_DIM4)<25.75,(Frame_Width-_DIM4)>31.75),\"N/A\",(D1055*D1056)/144)","v":"N/A"}]
[{"$f":"IF(ModelNo=B1058,1,\"\")","v":""},"6CPC","Operating Sash Width",{"$f":"TRUNC((_DIM4-1.25)*16+0.5)/16","v":-1.1875}]
[{"$f":"IF(ModelNo=B1059,2,\"\")","v":""},"6CPC","Operating Sash height",{"$f":"TRUNC((Frame_Height-1.625)*16+0.5)/16","v":-1.5625}]
[{"$f":"IF(ModelNo=B1060,3,\"\")","v":""},"6CPC","Vent Wrap Sash Width",{"$f":"TRUNC((Frame_Width-(2*_DIM4)-0.875)*16+0.5)/16","v":-0.8125}]
[{"$f":"IF(ModelNo=B1061,4,\"\")","v":""},"6CPC","Vent Wrap Sash Height",{"$f":"TRUNC((Frame_Height-1.625)*16+0.5)/16","v":-1.5625}]
[{"$f":"IF(ModelNo=B1062,5,\"\")","v":""},"6CPC","Operating Sash Glass Width",{"$f":"D1058-3.9375","v":-5.125}]
[{"$f":"IF(ModelNo=B1063,6,\"\")","v":""},"6CPC","Operating Sash Glass Height",{"$f":"D1059-3.9375","v":-5.5}]
[{"$f":"IF(ModelNo=B1064,7,\"\")","v":""},"6CPC","Picture Window Glass Width (No VW)",{"$f":"TRUNC((Frame_Width-(2*_DIM4)-3.375)*16+0.5)/16","v":-3.3125}]
[{"$f":"IF(ModelNo=B1065,8,\"\")","v":""},"6CPC","Picture Window Glass Height (No VW)",{"$f":"TRUNC((Frame_Height-4.125)*16+0.5)/16","v":-4.0625}]
[{"$f":"IF(ModelNo=B1066,9,\"\")","v":""},"6CPC","Picture Window Glass Width (With VW)",{"$f":"D1060-3.9375","v":-4.75}]
[{"$f":"IF(ModelNo=B1067,10,\"\")","v":""},"6CPC","Picture Window Glass Height (With VW)",{"$f":"D1061-3.9375","v":-5.5}]
[{"$f":"IF(ModelNo=B1068,11,\"\")","v":""},"6CPC","Screen Width",{"$f":"D1058-3.3125","v":-4.5}]
[{"$f":"IF(ModelNo=B1069,12,\"\")","v":""},"6CPC","Screen Height",{"$f":"D1059-3.3125","v":-4.875}]
[{"$f":"IF(ModelNo=B1070,13,\"\")","v":""},"6CPC","Egress Opening Width (Standard Hinge)",{"$f":"IF(ISERROR(EW),\"N/A\",EW)","v":"N/A"}]
[{"$f":"IF(ModelNo=B1071,14,\"\")","v":""},"6CPC","Egress Opening Height (Standard Hinge)",{"$f":"IF(ISERROR(EH),\"N/A\",EH)","v":"N/A"}]
[{"$f":"IF(ModelNo=B1072,15,\"\")","v":""},"6CPC","Egress Opening Area (Standard Hinge)",{"$f":"IF(ISERROR(EO),\"N/A\",EO)","v":"N/A"}]
[{"$f":"IF(ModelNo=B1073,16,\"\")","v":""},"6CPC",{"$f":"IF(OR(_DIM4<25.75,_DIM4>31.75),\"Egress Hardware Not Available For This Width\",\"Egress Opening Width (Egress Hinge)\")","v":"Egress Hardware Not Available For This Width"},{"$f":"IF(OR(_DIM4<25.75,_DIM4>31.75),\"N/A\",_DIM4-7.125)","v":"N/A"}]
[{"$f":"IF(ModelNo=B1074,17,\"\")","v":""},"6CPC",{"$f":"IF(OR(_DIM4<25.75,_DIM4>31.75),\"Egress Hardware Not Available For This Width\",\"Egress Opening Height (Egress Hinge)\")","v":"Egress Hardware Not Available For This Width"},{"$f":"IF(OR(_DIM4<25.75,_DIM4>31.75),\"N/A\",Frame_Height-5.125)","v":"N/A"}]
[{"$f":"IF(ModelNo=B1075,18,\"\")","v":""},"6CPC",{"$f":"IF(OR(_DIM4<25.75,_DIM4>31.75),\"Egress Hardware Not Available For This Width\",\"Egress Opening Area (Egress Hinge)\")","v":"Egress Hardware Not Available For This Width"},{"$f":"IF(OR(_DIM4<25.75,_DIM4>31.75),\"N/A\",(D1073*D1074)/144)","v":"N/A"}]
[{"$f":"IF(ModelNo=B1076,1,\"\")","v":""},"6CSP","Operating Sash Width",{"$f":"TRUNC((_DIM4-1.25)*16+0.5)/16","v":-1.1875}]
[{"$f":"IF(ModelNo=B1077,2,\"\")","v":""},"6CSP","Operating Sash Height",{"$f":"TRUNC((Frame_Height-_DIM3-1.25)*16+0.5)/16","v":-1.1875}]
[{"$f":"IF(ModelNo=B1078,3,\"\")","v":""},"6CSP","Top Vent Wrap Sash Width",{"$f":"TRUNC((Frame_Width-(2*_DIM4)-0.875)*16+0.5)/16","v":-0.8125}]
[{"$f":"IF(ModelNo=B1079,4,\"\")","v":""},"6CSP","Top Vent Wrap Sash Height",{"$f":"TRUNC((Frame_Height-_DIM3-1.25)*16+0.5)/16","v":-1.1875}]
[{"$f":"IF(ModelNo=B1080,5,\"\")","v":""},"6CSP","Bottom Vent Wrap Sash Width",{"$f":"Frame_Width-1.625","v":-1.625}]
[{"$f":"IF(ModelNo=B1081,6,\"\")","v":""},"6CSP","Bottom Vent Wrap Sash Height",{"$f":"TRUNC((_DIM3-1.25)*16+0.5)/16","v":-1.1875}]
[{"$f":"IF(ModelNo=B1082,7,\"\")","v":""},"6CSP","Operating Sash Glass Width",{"$f":"D1076-3.9375","v":-5.125}]
[{"$f":"IF(ModelNo=B1083,8,\"\")","v":""},"6CSP","Operating Sash Glass Height",{"$f":"D1077-3.9375","v":-5.125}]
[{"$f":"IF(ModelNo=B1084,9,\"\")","v":""},"6CSP","Top PW Glass Width (No VW)",{"$f":"TRUNC((Frame_Width-(2*_DIM4)-3.375)*16+0.5)/16","v":-3.3125}]
[{"$f":"IF(ModelNo=B1085,10,\"\")","v":""},"6CSP","Top PW Glass Height (No VW)",{"$f":"Frame_Height-_DIM3-3.75","v":-3.75}]
[{"$f":"IF(ModelNo=B1086,11,\"\")","v":""},"6CSP","Top PW Glass Width (With VW)",{"$f":"D1078-3.9375","v":-4.75}]
[{"$f":"IF(ModelNo=B1087,12,\"\")","v":""},"6CSP","Top PW Glass Height (With VW)",{"$f":"D1079-3.9375","v":-5.125}]
[{"$f":"IF(ModelNo=B1088,13,\"\")","v":""},"6CSP","Bottom PW Glass Width (No VW)",{"$f":"Frame_Width-4.125","v":-4.125}]
[{"$f":"IF(ModelNo=B1089,14,\"\")","v":""},"6CSP","Bottom PW Glass Height (No VW)",{"$f":"_DIM3-3.75","v":-3.75}]
[{"$f":"IF(ModelNo=B1090,15,\"\")","v":""},"6CSP","Bottom PW Glass Width (With VW)",{"$f":"D1080-3.9375","v":-5.5625}]
[{"$f":"IF(ModelNo=B1091,16,\"\")","v":""},"6CSP","Bottom PW Glass Height (With VW)",{"$f":"D1081-3.9375","v":-5.125}]
[{"$f":"IF(ModelNo=B1092,17,\"\")","v":""},"6CSP","Screen Width",{"$f":"D1076-3.3125","v":-4.5}]
[{"$f":"IF(ModelNo=B1093,18,\"\")","v":""},"6CSP","Screen Height",{"$f":"D1077-3.3125","v":-4.5}]
[{"$f":"IF(ModelNo=B1094,19,\"\")","v":""},"6CSP","Egress Opening Width (Standard Hinge)",{"$f":"IF(ISERROR(EW),\"N/A\",EW)","v":"N/A"}]
[{"$f":"IF(ModelNo=B1095,20,\"\")","v":""},"6CSP","Egress Opening Height (Standard Hinge)",{"$f":"IF(ISERROR(EH),\"N/A\",EH)","v":"N/A"}]
[{"$f":"IF(ModelNo=B1096,21,\"\")","v":""},"6CSP","Egress Opening Area (Standard Hinge)",{"$f":"IF(ISERROR(EO),\"N/A\",EO)","v":"N/A"}]
[{"$f":"IF(ModelNo=B1097,22,\"\")","v":""},"6CSP",{"$f":"IF(OR(_DIM4<25.75,_DIM4>31.75),\"Egress Hardware Not Available For This Width\",\"Egress Opening Width (Egress Hinge)\")","v":"Egress Hardware Not Available For This Width"},{"$f":"IF(OR(_DIM4<25.75,_DIM4>31.75),\"N/A\",_DIM4-7.125)","v":"N/A"}]
[{"$f":"IF(ModelNo=B1098,23,\"\")","v":""},"6CSP",{"$f":"IF(OR(_DIM4<25.75,_DIM4>31.75),\"Egress Hardware Not Available For This Width\",\"Egress Opening Height (Egress Hinge)\")","v":"Egress Hardware Not Available For This Width"},{"$f":"IF(OR(_DIM4<25.75,_DIM4>31.75),\"N/A\",Frame_Height-_DIM3-5.125)","v":"N/A"}]
[{"$f":"IF(ModelNo=B1099,24,\"\")","v":""},"6CSP",{"$f":"IF(OR(_DIM4<25.75,_DIM4>31.75),\"Egress Hardware Not Available For This Width\",\"Egress Opening Area (Egress Hinge)\")","v":"Egress Hardware Not Available For This Width"},{"$f":"IF(OR(_DIM4<25.75,_DIM4>31.75),\"N/A\",(D1097*D1098)/144)","v":"N/A"}]
[{"$f":"IF(ModelNo=B1100,1,\"\")","v":""},"62HP","Top Vent Wrap Width",{"$f":"TRUNC((Frame_Width-1.625)*16+0.5)/16","v":-1.5625}]
[{"$f":"IF(ModelNo=B1101,2,\"\")","v":""},"62HP","Top Vent Wrap Height",{"$f":"TRUNC((Frame_Height-_DIM3-1.25)*16+0.5)/16","v":-1.1875}]
[{"$f":"IF(ModelNo=B1102,3,\"\")","v":""},"62HP","Bottom Vent Wrap Width",{"$f":"TRUNC((Frame_Width-1.625)*16+0.5)/16","v":-1.5625}]
[{"$f":"IF(ModelNo=B1103,4,\"\")","v":""},"62HP","Bottom Vent Wrap Height",{"$f":"TRUNC((_DIM3-1.25)*16+0.5)/16","v":-1.1875}]
[{"$f":"IF(ModelNo=B1104,5,\"\")","v":""},"62HP","Top Glass Width (No VW)",{"$f":"TRUNC((Frame_Width-4.125)*16+0.5)/16","v":-4.0625}]
[{"$f":"IF(ModelNo=B1105,6,\"\")","v":""},"62HP","Top Glass Height (No VW)",{"$f":"TRUNC((Frame_Height-_DIM3-3.75)*16+0.5)/16","v":-3.6875}]
[{"$f":"IF(ModelNo=B1106,7,\"\")","v":""},"62HP","Top Glass Width (With VW)",{"$f":"D1100-3.9375","v":-5.5}]
[{"$f":"IF(ModelNo=B1107,8,\"\")","v":""},"62HP","Top Glass Height (With VW)",{"$f":"D1101-3.9375","v":-5.125}]
[{"$f":"IF(ModelNo=B1108,9,\"\")","v":""},"62HP","Bottom Glass Width (No VW)",{"$f":"TRUNC((Frame_Width-4.125)*16+0.5)/16","v":-4.0625}]
[{"$f":"IF(ModelNo=B1109,10,\"\")","v":""},"62HP","Bottom Glass Height (No VW)",{"$f":"TRUNC((_DIM3-3.75)*16+0.5)/16","v":-3.6875}]
[{"$f":"IF(ModelNo=B1110,11,\"\")","v":""},"62HP","Bottom Glass Width (With VW)",{"$f":"D1102-3.9375","v":-5.5}]
[{"$f":"IF(ModelNo=B1111,12,\"\")","v":""},"62HP","Bottom Glass Height (With VW)",{"$f":"D1103-3.9375","v":-5.125}]
[{"$f":"IF(ModelNo=B1112,1,\"\")","v":""},"62HX","Top Vent Wrap Width",{"$f":"TRUNC((Frame_Width-1.625)*16+0.5)/16","v":-1.5625}]
[{"$f":"IF(ModelNo=B1113,2,\"\")","v":""},"62HX","Top Vent Wrap Height",{"$f":"TRUNC((Frame_Height-_DIM3-1.25)*16+0.5)/16","v":-1.1875}]
[{"$f":"IF(ModelNo=B1114,3,\"\")","v":""},"62HX","Bottom Vent Wrap Width",{"$f":"TRUNC((Frame_Width-1.625)*16+0.5)/16","v":-1.5625}]
[{"$f":"IF(ModelNo=B1115,4,\"\")","v":""},"62HX","Bottom Vent Wrap Height",{"$f":"TRUNC((_DIM3-1.25)*16+0.5)/16","v":-1.1875}]
[{"$f":"IF(ModelNo=B1116,5,\"\")","v":""},"62HX","Top Glass Width (No VW)",{"$f":"TRUNC((Frame_Width-4.125)*16+0.5)/16","v":-4.0625}]
[{"$f":"IF(ModelNo=B1117,6,\"\")","v":""},"62HX","Top Glass Height (No VW)",{"$f":"TRUNC((Frame_Height-_DIM3-3.75)*16+0.5)/16","v":-3.6875}]
[{"$f":"IF(ModelNo=B1118,7,\"\")","v":""},"62HX","Top Glass Width (With VW)",{"$f":"D1112-3.9375","v":-5.5}]
[{"$f":"IF(ModelNo=B1119,8,\"\")","v":""},"62HX","Top Glass Height (With VW)",{"$f":"D1113-3.9375","v":-5.125}]
[{"$f":"IF(ModelNo=B1120,9,\"\")","v":""},"62HX","Bottom Glass Width (No VW)",{"$f":"TRUNC((Frame_Width-4.125)*16+0.5)/16","v":-4.0625}]
[{"$f":"IF(ModelNo=B1121,10,\"\")","v":""},"62HX","Bottom Glass Height (No VW)",{"$f":"TRUNC((_DIM3-3.75)*16+0.5)/16","v":-3.6875}]
[{"$f":"IF(ModelNo=B1122,11,\"\")","v":""},"62HX","Bottom Glass Width (With VW)",{"$f":"D1114-3.9375","v":-5.5}]
[{"$f":"IF(ModelNo=B1123,12,\"\")","v":""},"62HX","Bottom Glass Height (With VW)",{"$f":"D1115-3.9375","v":-5.125}]
[{"$f":"IF(ModelNo=B1124,1,\"\")","v":""},"62WP","Left Vent Wrap Width",{"$f":"TRUNC((_DIM4-1.25)*16+0.5)/16","v":-1.1875}]
[{"$f":"IF(ModelNo=B1125,2,\"\")","v":""},"62WP","Left Vent Wrap Height",{"$f":"TRUNC((Frame_Height-1.625)*16+0.5)/16","v":-1.5625}]
[{"$f":"IF(ModelNo=B1126,3,\"\")","v":""},"62WP","Right Vent Wrap Width",{"$f":"TRUNC((Frame_Width-_DIM4-1.25)*16+0.5)/16","v":-1.1875}]
[{"$f":"IF(ModelNo=B1127,4,\"\")","v":""},"62WP","Right Vent Wrap Height",{"$f":"TRUNC((Frame_Height-1.625)*16+0.5)/16","v":-1.5625}]
[{"$f":"IF(ModelNo=B1128,5,\"\")","v":""},"62WP","Left Glass Width (No VW)",{"$f":"TRUNC((_DIM4-3.75)*16+0.5)/16","v":-3.6875}]
[{"$f":"IF(ModelNo=B1129,6,\"\")","v":""},"62WP","Left Glass Height (No VW)",{"$f":"TRUNC((Frame_Height-4.125)*16+0.5)/16","v":-4.0625}]
[{"$f":"IF(ModelNo=B1130,7,\"\")","v":""},"62WP","Left Glass Width (With VW)",{"$f":"D1124-3.9375","v":-5.125}]
[{"$f":"IF(ModelNo=B1131,8,\"\")","v":""},"62WP","Left Glass Height (With VW)",{"$f":"D1125-3.9375","v":-5.5}]
[{"$f":"IF(ModelNo=B1132,9,\"\")","v":""},"62WP","Right Glass Width (No VW)",{"$f":"TRUNC((Frame_Width-_DIM4-3.75)*16+0.5)/16","v":-3.6875}]
[{"$f":"IF(ModelNo=B1133,10,\"\")","v":""},"62WP","Right Glass Height (No VW)",{"$f":"TRUNC((Frame_Height-4.125)*16+0.5)/16","v":-4.0625}]
[{"$f":"IF(ModelNo=B1134,11,\"\")","v":""},"62WP","Right Glass Width (With VW)",{"$f":"D1126-3.9375","v":-5.125}]
[{"$f":"IF(ModelNo=B1135,12,\"\")","v":""},"62WP","Right Glass Height (With VW)",{"$f":"D1127-3.9375","v":-5.5}]
[{"$f":"IF(ModelNo=B1136,1,\"\")","v":""},"63WP","Left Vent Wrap Width",{"$f":"TRUNC((_DIM4-1.25)*16+0.5)/16","v":-1.1875}]
[{"$f":"IF(ModelNo=B1137,2,\"\")","v":""},"63WP","Right Vent Wrap Width",{"$f":"TRUNC((_DIM4-1.25)*16+0.5)/16","v":-1.1875}]
[{"$f":"IF(ModelNo=B1138,3,\"\")","v":""},"63WP","Center Vent Wrap Width",{"$f":"TRUNC((Frame_Width-(2*_DIM4)-0.875)*16+0.5)/16","v":-0.8125}]
[{"$f":"IF(ModelNo=B1139,4,\"\")","v":""},"63WP","Vent Wrap Height",{"$f":"TRUNC((Frame_Height-1.625)*16+0.5)/16","v":-1.5625}]
[{"$f":"IF(ModelNo=B1140,5,\"\")","v":""},"63WP","Left Glass Width (No VW)",{"$f":"TRUNC((_DIM4-3.75)*16+0.5)/16","v":-3.6875}]
[{"$f":"IF(ModelNo=B1141,6,\"\")","v":""},"63WP","Right Glass Width (No VW)",{"$f":"TRUNC((_DIM4-3.75)*16+0.5)/16","v":-3.6875}]
[{"$f":"IF(ModelNo=B1142,7,\"\")","v":""},"63WP","Middle Glass Width (No VW)",{"$f":"TRUNC((Frame_Width-(2*_DIM4)-3.375)*16+0.5)/16","v":-3.3125}]
[{"$f":"IF(ModelNo=B1143,8,\"\")","v":""},"63WP","Left Glass Width (With VW)",{"$f":"D1136-3.9375","v":-5.125}]
[{"$f":"IF(ModelNo=B1144,9,\"\")","v":""},"63WP","Right Glass Width (With VW)",{"$f":"D1137-3.9375","v":-5.125}]
[{"$f":"IF(ModelNo=B1145,10,\"\")","v":""},"63WP","Middle Glass Width (With VW)",{"$f":"D1138-3.9375","v":-4.75}]
[{"$f":"IF(ModelNo=B1146,11,\"\")","v":""},"63WP","Glass Height (No VW)",{"$f":"TRUNC((Frame_Height-4.125)*16+0.5)/16","v":-4.0625}]
[{"$f":"IF(ModelNo=B1147,12,\"\")","v":""},"63WP","Glass Height (With VW)",{"$f":"D1139-3.9375","v":-5.5}]
[{"$f":"IF(ModelNo=B1148,1,\"\")","v":""},"63HP","Top Vent Wrap Height",{"$f":"TRUNC((_DIM3-1.25)*16+0.5)/16","v":-1.1875}]
[{"$f":"IF(ModelNo=B1149,2,\"\")","v":""},"63HP","Bottom Vent Wrap Height",{"$f":"TRUNC((_DIM3-1.25)*16+0.5)/16","v":-1.1875}]
[{"$f":"IF(ModelNo=B1150,3,\"\")","v":""},"63HP","Center Vent Wrap Height",{"$f":"TRUNC((Frame_Height-(2*_DIM3)-0.875)*16+0.5)/16","v":-0.8125}]
[{"$f":"IF(ModelNo=B1151,4,\"\")","v":""},"63HP","All Vent Wrap Widths",{"$f":"TRUNC((Frame_Width-1.625)*16+0.5)/16","v":-1.5625}]
[{"$f":"IF(ModelNo=B1152,5,\"\")","v":""},"63HP","Top Glass Height (No VW)",{"$f":"TRUNC((_DIM3-3.75)*16+0.5)/16","v":-3.6875}]
[{"$f":"IF(ModelNo=B1153,6,\"\")","v":""},"63HP","Bottom Glass Height (No VW)",{"$f":"TRUNC((_DIM3-3.75)*16+0.5)/16","v":-3.6875}]
[{"$f":"IF(ModelNo=B1154,7,\"\")","v":""},"63HP","Middle Glass Height (No VW)",{"$f":"TRUNC((Frame_Height-(2*_DIM3)-3.375)*16+0.5)/16","v":-3.3125}]
[{"$f":"IF(ModelNo=B1155,8,\"\")","v":""},"63HP","Top Glass Height (With VW)",{"$f":"D1148-3.9375","v":-5.125}]
[{"$f":"IF(ModelNo=B1156,9,\"\")","v":""},"63HP","Bottom Glass Height (With VW)",{"$f":"D1149-3.9375","v":-5.125}]
[{"$f":"IF(ModelNo=B1157,10,\"\")","v":""},"63HP","Middle Glass Height (With VW)",{"$f":"D1150-3.9375","v":-4.75}]
[{"$f":"IF(ModelNo=B1158,11,\"\")","v":""},"63HP","All Glass Widths (No VW)",{"$f":"TRUNC((Frame_Width-4.125)*16+0.5)/16","v":-4.0625}]
[{"$f":"IF(ModelNo=B1159,12,\"\")","v":""},"63HP","All Glass Widths (With VW)",{"$f":"D1151-3.9375","v":-5.5}]